program: Gaussian 09
title: 000144740
version: EM64L-G09RevD.01
frameworkgroup: C1[X(C3H7BrS)]
method: RPBEPBE
basis: SDD
operation: Freq
keyword: #p
keyword: freq=noraman
keyword: PBEPBE/SDD
title: #p freq=noraman PBEPBE/SDD
converged: NO NO NO NO
title: Mulliken charges:
elementType: Br S C C C H H H H H H H
charge: -0.024852 -0.016315 -0.274134 -0.687327 -0.660015 0.249091 0.249259 0.256367 0.256452 0.274405 0.274461 0.102607
chargesum: 0.00000
title: Mulliken charges with hydrogens summed into heavy atoms:
elementType: Br S C C C
charge: -0.024852 0.086292 0.224216 -0.174508 -0.111149
polarizability: 9.69305738e+01 6.65169841e+00 5.40521897e+01 -5.30100620e-02 -4.25855167e-02 3.63871804e+01
1716.lowfreq: 0.0011 0.0022 0.0025 2.8952 3.2164 23.2247 92.8987 99.1598 106.1374
frequency: 92.6956 98.5436 106.1349 153.9149 242.5994 316.4409 594.2613 727.4549 762.9659 820.4037 825.4108 992.1497 1049.9628 1055.5502 1084.5918 1223.8987 1249.4321 1274.8115 1292.7247 1338.6223 1453.2471 1462.6691 1480.8909 2409.6635 3008.2886 3017.8672 3042.7960 3063.8538 3088.0306 3126.7847
redmass: 2.0644 2.3916 8.0619 1.1588 6.4752 4.3358 6.1681 4.3557 1.0792 1.2180 1.2537 1.2820 3.3565 3.5160 1.0264 1.1557 1.3208 1.2042 1.0885 1.3500 1.1014 1.0761 1.0923 1.0385 1.0574 1.0587 1.0562 1.1051 1.1082 1.1108
irintensity: 1.9099 2.5250 0.6373 26.0024 2.5894 11.5839 26.4230 3.8481 13.5503 0.0501 0.5694 3.9945 1.1746 4.2701 0.0056 6.7697 2.6819 34.7814 0.0436 31.1316 2.2888 2.1536 9.8495 35.9263 12.6342 16.8439 28.9926 0.6127 23.1496 22.4160
temp: 298.150 k
press: 1.00000 atm
elementType: 35 16 6 6 6 1 1 1 1 1 1 1
symmnumber: 1
zpe: 241984.6 jmol-1
zpe.correction: 0.092167 hartree
zpe.thermalcorrener: 0.099445 hartree
zpe.thermalcorrenthalpy: 0.100390 hartree
zpe.thermalcorrgfe: 0.058690 hartree
zpe.sumelectzpe: -529.605003 hartree
zpe.sumelectthermal: -529.597724 hartree
zpe.sumelectthermalent: -529.596780 hartree
zpe.sumelectthermalfe: -529.638479 hartree
dipole: 1.6650 2.6377 -0.0087
dipole: 3.1193
quadrupole: -51.8004 -47.1491 -49.4346
quadrupole: 5.6915 -0.0532 -0.0110
quadrupole: -2.3390 2.3122 0.0268 5.6915 -0.0532 -0.0110
hfenergy: -529.6971696 hartree
pointgroup: C01 [X(C3H7Br1S1)]
dipole: -0.6085268 -1.065546 -0.0188347 debye
dipolederiv: -0.5754646 -0.0727234 -0.0025551 -0.1924942 -0.2015316 -0.001453 -0.0037493 -0.000923 -0.1406776 -0.2209918 0.1348281 0.003201 0.0623476 0.1309637 0.0083122 0.0018652 0.0081074 -0.2656299 -0.1874541 -0.0363582 -0.001916 -0.0619703 -0.0416673 -0.0017818 -0.0019163 -0.0018806 0.1095681 0.286901 -0.2098931 -0.0020881 0.0352893 0.1038179 -0.001813 0.0014091 -0.0026045 0.1710594 0.7244741 0.2392312 0.0049464 0.2433087 0.2682234 0.0022956 0.005053 0.002304 0.1467524 0.0794358 0.0078974 0.0036674 0.0074218 0.0105809 -0.0926952 -0.0047246 -0.0884649 -0.0355922 0.0792945 0.0070068 -0.0023774 0.0064833 0.0062514 0.0936663 0.0060545 0.0895596 -0.0312216 -0.0187274 0.0732737 0.0218546 0.0433324 -0.0464423 -0.1103419 0.0007349 -0.1171695 -0.0483181 -0.0185127 0.0731644 -0.0199915 0.0423463 -0.0526547 0.1108839 0.0003407 0.1177088 -0.0426762 -0.0262459 -0.082706 -0.0292046 -0.031876 -0.0269749 -0.0938548 0.0174704 -0.1018353 -0.0221804 -0.0261858 -0.084017 0.0272056 -0.0319901 -0.0314269 0.0934094 -0.0183158 0.1009922 -0.0175926 -0.0965231 -0.049704 -0.0027424 -0.1221988 -0.1191396 -0.0066278 -0.0042219 -0.0057942 0.1765086 unknown
polarizability: 96.2577465|8.5155921|54.7190824|0.3858778|0.3022465|36.3931151 unknown
InChI: InChI=1S/C3H7BrS/c4-2-1-3-5/h5H,1-3H2
charge 0 multiplicity 1
12 atoms
Br 2.923321 0.499296 0.022058
S  -2.794642 0.529207 0.001203
C  -0.016829 0.255914 0.008354
C  -1.288755 -0.621645 -0.007557
C  1.237691 -0.628083 0.002959
H  -0.017339 0.900305 0.906206
H  -0.010092 0.921612 -0.873775
H  -1.318708 -1.250286 -0.915104
H  -1.325642 -1.273205 0.883405
H  1.319213 -1.24399 -0.907348
H  1.312432 -1.26464 0.899529
H  -3.753851 -0.475083 -0.02583
