program: Gaussian 09
title: 000145342
version: EM64L-G09RevD.01
frameworkgroup: C1[X(C7H20SSi2)]
method: RPBEPBE
basis: SDD
operation: Freq
keyword: #p
keyword: freq=noraman
keyword: PBEPBE/SDD
title: #p freq=noraman PBEPBE/SDD
converged: NO YES NO NO
title: Mulliken charges:
elementType: S Si Si C C C C C C C H H H H H H H H H H H H H H H H H H H H
charge: -0.030874 1.338779 1.342981 -1.241901 -1.009846 -1.000955 -1.017033 -1.003146 -1.020643 -1.011445 0.308194 0.237573 0.229747 0.233680 0.256516 0.230046 0.227688 0.232071 0.233516 0.239768 0.229992 0.256354 0.228437 0.234367 0.239628 0.235995 0.231369 0.238268 0.230278 0.100598
chargesum: 0.00000
title: Mulliken charges with hydrogens summed into heavy atoms:
elementType: S Si Si C C C C C C C
charge: 0.069725 1.338779 1.342981 -0.933707 -0.308847 -0.286706 -0.311678 -0.288363 -0.310653 -0.311531
polarizability: 1.48431131e+02 4.67670519e-02 1.45937866e+02 -1.91615005e-01 -2.58638985e+00 1.28147606e+02
1716.lowfreq: -22.2398 -15.8126 -0.0011 0.0019 0.0022 2.7436 18.8442 46.3925 88.9436
frequency: -18.9303 46.3162 88.9004 104.2631 111.3234 119.7851 126.3108 129.5506 136.0800 141.4107 157.5808 164.0413 174.2411 177.6456 198.8115 201.7186 211.0382 212.8424 233.2705 259.0051 277.3298 332.8620 499.1142 583.8856 602.2350 676.1127 684.4310 688.0431 690.1262 692.3136 735.7642 739.9861 759.1061 782.3262 800.0158 813.7150 821.9418 851.8793 884.4609 895.8263 903.7671 907.1992 909.8795 929.4541 1077.3879 1171.4652 1284.8551 1285.6768 1289.2120 1293.1926 1297.4446 1306.1104 1434.2921 1438.3751 1441.0326 1442.6679 1448.5651 1450.0301 1451.8481 1453.1276 1456.5489 1459.5600 1462.3356 1468.2989 2428.8158 2978.9088 2979.4722 2980.2112 2981.5034 2981.6063 2982.6690 2991.6723 3077.0234 3078.8369 3079.4873 3080.3066 3081.1971 3082.0095 3088.3369 3090.2702 3091.6672 3093.0617 3093.4312 3096.3446
redmass: 2.7447 3.3112 1.0473 1.3012 1.5476 1.1007 1.0820 1.9421 3.1628 1.2246 2.3460 1.6816 3.3120 2.1882 2.3432 2.4954 2.2967 2.4971 1.2140 2.7151 3.8971 3.9194 3.7036 3.9744 4.4987 4.2157 3.3012 3.1851 3.4655 2.9396 1.1864 1.1700 2.0567 1.3323 1.2316 1.7065 1.3783 1.2792 1.4484 1.4578 1.5219 1.5710 1.6774 1.5802 1.2183 1.0981 1.2071 1.2050 1.2017 1.2010 1.1918 1.1897 1.0526 1.0545 1.0531 1.0524 1.0499 1.0543 1.0521 1.0525 1.0516 1.0490 1.0496 1.0474 1.0381 1.0341 1.0341 1.0343 1.0343 1.0345 1.0345 1.0810 1.0986 1.0981 1.0982 1.0974 1.0976 1.0972 1.0987 1.0984 1.0980 1.0983 1.0983 1.0972
irintensity: 0.0103 0.2040 0.2512 0.0187 0.0120 0.0466 0.1401 0.9883 2.1702 0.4523 0.6694 0.6053 2.2044 0.1160 6.1439 2.2653 0.3800 2.8320 12.0509 19.6616 2.5260 2.4150 5.0198 3.6257 3.4294 6.3523 0.4434 6.1454 13.6758 14.7809 0.0392 0.1872 2.3382 0.1076 7.1921 4.7492 10.5113 15.5032 29.8701 1.3824 105.6967 152.3495 361.9804 79.9213 35.8714 3.9486 0.9611 16.0539 69.9577 87.2441 44.0956 13.9900 1.8798 2.9352 3.3853 4.7387 0.3671 1.4712 1.6949 9.1860 15.3153 23.3077 18.7241 5.6690 21.2693 18.1874 15.3241 3.5110 15.6258 30.9052 13.9810 3.1273 11.1941 5.5719 7.4851 15.5766 51.2739 28.4366 12.3577 12.2633 10.4054 6.2316 21.6375 30.9248
temp: 298.150 k
press: 1.00000 atm
elementType: 16 14 14 6 6 6 6 6 6 6 1 1 1 1 1 1 1 1 1 1 1 1 1 1 1 1 1 1 1 1
symmnumber: 1
zpe: 647208.2 jmol-1
zpe.correction: 0.246509 hartree
zpe.thermalcorrener: 0.264548 hartree
zpe.thermalcorrenthalpy: 0.265492 hartree
zpe.thermalcorrgfe: 0.201939 hartree
zpe.sumelectzpe: -1254.773961 hartree
zpe.sumelectthermal: -1254.755922 hartree
zpe.sumelectthermalent: -1254.754977 hartree
zpe.sumelectthermalfe: -1254.818530 hartree
dipole: 0.0002 1.6296 0.6191
dipole: 1.7433
quadrupole: -87.7788 -93.6033 -86.6042
quadrupole: -0.0102 -0.0209 -2.5754
quadrupole: 1.5500 -4.2745 2.7246 -0.0102 -0.0209 -2.5754
hfenergy: -1255.0204693 hartree
pointgroup: C01 [X(C7H20S1Si2)]
dipole: -0.006233 0.6643429 0.1702841 debye
polarizability: 148.4307794|0.0611322|145.1406227|-0.1283521|-4.5013906|128.945201 unknown
InChI: InChI=1S/C7H20SSi2/c1-9(2,3)7(8)10(4,5)6/h7-8H,1-6H3
charge 0 multiplicity 1
30 atoms
S  0.007846 -2.464316 0.164041
Si 1.698513 0.198246 -0.00362
Si -1.705162 0.173684 -0.012065
C  0.003834 -0.627267 -0.45119
C  1.798948 1.972105 -0.732354
C  3.098678 -0.851329 -0.779006
C  1.932735 0.277857 1.896592
C  -3.072262 -0.822388 -0.907985
C  -2.01569 0.126008 1.878315
C  -1.777676 1.994555 -0.617196
H  0.007705 -0.768859 -1.553541
H  2.840932 2.33883 -0.66863
H  1.502465 1.986022 -1.797497
H  1.154654 2.68609 -0.190239
H  2.994919 -1.91111 -0.486107
H  3.069586 -0.795643 -1.883102
H  4.089929 -0.490666 -0.44594
H  1.130041 0.856865 2.388049
H  1.955196 -0.733154 2.342809
H  2.895441 0.767777 2.13516
H  -3.006804 -0.689219 -2.003848
H  -2.972178 -1.899666 -0.685472
H  -4.076634 -0.490767 -0.58435
H  -1.217881 0.639563 2.444615
H  -2.972186 0.630893 2.110957
H  -2.090433 -0.912966 2.247747
H  -1.42655 2.087097 -1.661275
H  -2.822549 2.356503 -0.578925
H  -1.164374 2.665672 0.009748
H  -0.002141 -2.172721 1.519809
