program: Gaussian 09
title: 000146373
version: EM64L-G09RevD.01
frameworkgroup: C1[X(C12H22O10S)]
method: RPBEPBE
basis: SDD
operation: Freq
keyword: #p
keyword: freq=noraman
keyword: PBEPBE/SDD
title: #p freq=noraman PBEPBE/SDD
converged: YES YES NO NO
title: Mulliken charges:
elementType: S O O O O O O O O O O C C C C C C C C C C C C H H H H H H H H H H H H H H H H H H H H H H
charge: -0.024188 -0.278341 -0.327032 -0.317308 -0.467939 -0.451676 -0.438800 -0.459959 -0.463752 -0.436712 -0.450735 0.332396 -0.229852 -0.171268 -0.106691 -0.065175 -0.221892 -0.143552 -0.056176 0.030653 -0.406406 -0.366129 -0.783173 0.259890 0.251147 0.263322 0.250436 0.280189 0.234293 0.244546 0.267328 0.220028 0.288301 0.218632 0.221799 0.313520 0.280825 0.362598 0.399870 0.356617 0.366268 0.369934 0.368461 0.370630 0.115072
chargesum: 0.00000
title: Mulliken charges with hydrogens summed into heavy atoms:
elementType: S O O O O O O O O O O C C C C C C C C C C C C
charge: 0.090883 -0.278341 -0.327032 -0.317308 -0.105340 -0.051806 -0.082183 -0.093691 -0.093818 -0.068251 -0.080105 0.332396 0.030038 0.079879 0.156631 0.185261 0.058297 0.090741 0.188370 0.297981 0.101923 0.074302 -0.188828
polarizability: 1.95093363e+02 -7.64056211e-01 1.72781559e+02 2.55181459e+00 -1.04754948e+00 1.57729680e+02
1716.lowfreq: -9.7854 -4.8249 -0.0012 -0.0004 0.0013 5.3799 27.1563 42.2744 44.6299
frequency: 26.5990 42.2544 44.4992 68.7421 73.2335 91.9967 99.7735 119.4763 133.2273 144.4162 157.0088 165.2094 173.1767 196.0034 213.4572 222.2527 225.4526 248.3944 261.1205 272.1646 288.5979 295.7978 298.4778 309.6732 330.6124 350.1773 368.3316 383.9763 394.3256 405.4714 413.5169 418.0248 436.9409 469.8913 473.4568 493.3507 511.4134 529.2289 536.6701 562.8533 579.0394 610.9822 640.3287 676.6930 700.9726 721.5195 741.7051 754.3637 757.4797 786.4181 819.9682 845.5915 854.0279 900.2128 918.2796 926.7914 950.7108 952.5677 976.0781 980.5555 987.0278 999.5515 1003.3648 1008.5634 1020.6052 1024.2897 1042.5750 1050.2171 1058.0576 1061.7508 1070.4161 1075.3041 1102.9458 1105.6786 1130.0260 1164.5064 1175.4220 1207.2323 1209.5920 1219.1210 1225.0537 1233.3023 1235.2950 1238.7233 1263.0972 1272.5964 1277.8281 1287.9637 1293.8149 1307.4265 1311.1640 1312.3210 1323.9511 1327.2603 1342.0924 1360.5133 1371.2334 1373.5630 1381.8655 1388.1401 1394.9631 1405.2614 1411.4223 1426.7595 1429.0359 1467.2272 1480.0717 2444.7849 2969.8660 2970.1264 2991.8192 3012.6127 3020.1847 3023.0216 3041.6795 3048.0275 3053.8542 3062.4292 3073.4416 3083.8781 3124.3890 3144.7439 3224.9666 3337.1758 3515.7114 3546.4847 3560.6093 3561.4753 3578.9183
redmass: 6.7358 7.4977 6.5302 5.4512 5.4210 6.5435 5.2787 5.9761 6.7645 4.8722 4.8917 5.7864 5.0113 4.1407 3.0931 2.4663 2.3907 3.1911 3.1222 1.8822 3.1223 2.3065 3.3872 1.6021 5.1433 3.4150 6.0141 2.5871 2.6823 1.7519 1.5355 1.9061 5.3644 4.0805 3.1730 1.6650 3.2360 3.8688 5.3486 4.6165 3.9296 4.0372 4.2008 3.9168 1.3626 4.5068 3.4134 1.7113 2.2195 1.1513 3.0583 3.5073 2.8832 4.3461 3.3751 2.8721 3.2524 3.0290 5.6874 4.8125 4.8211 4.3704 2.8912 3.0955 4.5234 2.7728 2.9804 4.0149 2.6273 3.1272 2.9484 2.8545 2.3366 1.8906 2.5763 1.3911 1.1876 1.2430 1.2000 1.2311 1.5248 1.2054 1.2764 1.3090 1.5031 1.2363 1.3551 1.2230 1.3587 1.3344 1.2105 1.2669 1.1838 1.2693 1.3176 1.4488 1.2303 1.2393 1.1938 1.5703 1.2784 1.5521 1.1639 1.1169 1.1408 1.0751 1.0762 1.0381 1.0644 1.0823 1.0843 1.0684 1.0849 1.0819 1.0859 1.0615 1.0965 1.0867 1.0865 1.0904 1.1054 1.0963 1.0700 1.0672 1.0649 1.0656 1.0656 1.0658 1.0665
irintensity: 0.6451 0.5181 0.5595 1.2869 0.0649 2.5671 1.3301 4.7416 1.7543 3.1657 1.1616 1.4709 0.8029 24.8773 7.6900 4.7771 8.6352 16.7770 12.2540 15.4213 7.5024 52.2412 3.7100 89.3117 13.3905 24.6318 4.2388 58.0761 40.4157 147.5066 28.6679 32.0919 9.1419 21.7886 43.4862 164.0603 40.1724 49.7076 18.2487 5.5628 22.2356 10.3187 6.2724 30.0675 157.3029 11.5427 51.2463 7.5769 28.3952 86.3592 23.5503 80.8363 107.0564 115.6784 77.1986 24.8158 29.6975 85.1622 137.2877 105.2721 15.8259 130.3066 59.7235 9.9327 137.2824 30.1879 55.6338 23.0018 2.1775 79.0051 6.8571 49.2127 24.6885 31.2146 30.7689 4.9216 8.2567 23.7401 8.3943 37.1269 8.5307 50.0739 20.0817 42.8661 6.6315 2.8916 1.9373 23.9968 1.5631 17.4927 20.3684 16.0992 3.2685 5.2921 3.6129 4.8101 14.0199 4.2569 26.5257 4.3801 14.1330 10.2451 45.1166 17.1333 63.3119 5.5659 17.0416 16.7858 30.4401 13.9361 25.8366 33.2946 29.2119 8.6268 19.9153 16.2449 16.4800 58.8735 14.2281 26.8042 3.5709 1.0369 461.6253 194.5369 19.9877 20.5254 14.0006 24.8158 19.0911
temp: 298.150 k
press: 1.00000 atm
elementType: 16 8 8 8 8 8 8 8 8 8 8 6 6 6 6 6 6 6 6 6 6 6 6 1 1 1 1 1 1 1 1 1 1 1 1 1 1 1 1 1 1 1 1 1 1
symmnumber: 1
zpe: 924665.0 jmol-1
zpe.correction: 0.352186 hartree
zpe.thermalcorrener: 0.376731 hartree
zpe.thermalcorrenthalpy: 0.377676 hartree
zpe.thermalcorrgfe: 0.299220 hartree
zpe.sumelectzpe: -1618.837306 hartree
zpe.sumelectthermal: -1618.812761 hartree
zpe.sumelectthermalent: -1618.811817 hartree
zpe.sumelectthermalfe: -1618.890273 hartree
dipole: -1.0485 -2.9811 -3.5095
dipole: 4.7226
quadrupole: -157.8954 -150.3402 -148.7557
quadrupole: -5.0281 20.1939 -2.3481
quadrupole: -5.5649 1.9902 3.5747 -5.0281 20.1939 -2.3481
hfenergy: -1619.1894925 hartree
pointgroup: C01 [X(C12H22O10S1)]
dipole: 0.2453852 1.7437999 -0.5925696 debye
polarizability: 193.4397034|3.7144047|169.6126072|5.2388135|7.6432459|162.5522915 unknown
InChI: InChI=1S/C12H22O10S/c13-1-4-7(16)10(19)12(3-14,21-4)22-11-9(18)8(17)6(15)5(2-23)20-11/h4-11,13-19,23H,1-3H2
charge 0 multiplicity 1
45 atoms
S  -2.084355 -3.18081 -2.578382
O  1.278644 -0.558115 0.863015
O  -0.211067 1.201359 0.346522
O  -0.807957 -0.588191 -1.236061
O  3.264593 2.008374 -0.164409
O  1.782415 -0.79434 -2.130703
O  -2.349522 2.747602 -0.404732
O  -4.494815 0.832901 0.220338
O  -3.636457 -1.861622 0.829539
O  1.548555 0.791159 3.098303
O  3.426572 -1.342447 2.549146
C  1.207193 0.886363 0.604642
C  2.166117 1.149456 -0.615652
C  2.629464 -0.280607 -1.06328
C  2.527466 -1.101679 0.238438
C  -0.845468 0.830831 -0.929334
C  -2.2977 1.334093 -0.794828
C  -3.076354 0.463564 0.208125
C  -3.01905 -1.015031 -0.19382
C  -1.558499 -1.487191 -0.301615
C  1.532329 1.667259 1.920239
C  3.742442 -0.940867 1.188144
C  -1.403962 -2.909958 -0.833172
H  1.633175 1.631614 -1.456162
H  3.65032 -0.2620 -1.480834
H  2.311802 -2.165737 0.050489
H  -0.323658 1.305649 -1.778847
H  -2.787222 1.289735 -1.782266
H  -2.637819 0.588781 1.221818
H  -3.530699 -1.141213 -1.170976
H  -1.073355 -1.422972 0.691733
H  0.782848 2.471084 2.044661
H  2.535885 2.105668 1.864622
H  4.120891 0.102016 1.149168
H  4.547308 -1.614914 0.8442
H  -1.994338 -3.584504 -0.193353
H  -0.347646 -3.221912 -0.814592
H  3.814322 2.268883 -0.945134
H  0.83811 -0.904876 -1.794202
H  -1.694431 2.868118 0.333878
H  -4.554055 1.818227 0.322129
H  -4.554575 -1.519117 0.981624
H  0.711215 0.260686 3.11666
H  2.790929 -0.65871 2.916438
H  -1.150592 -2.389014 -3.224621
