program: Gaussian 09
title: 000145281
version: EM64L-G09RevD.01
frameworkgroup: C1[X(C10H17NO2S)]
method: RPBEPBE
basis: SDD
operation: Freq
keyword: #p
keyword: freq=noraman
keyword: PBEPBE/SDD
title: #p freq=noraman PBEPBE/SDD
converged: YES YES NO NO
title: Mulliken charges:
elementType: S O O N C C C C C C C C C C H H H H H H H H H H H H H H H H H
charge: 1.000566 -0.520162 -0.547224 -0.527504 -0.242729 -0.182750 0.390518 -0.120643 -0.247759 -0.518696 -0.506831 -0.736745 -0.774047 -0.771928 0.258424 0.252313 0.275722 0.279136 0.248488 0.235952 0.235723 0.277035 0.305661 0.296460 0.317065 0.217200 0.219780 0.220391 0.210251 0.243020 0.213312
chargesum: 0.00000
title: Mulliken charges with hydrogens summed into heavy atoms:
elementType: S O O N C C C C C C C C C C
charge: 1.000566 -0.520162 -0.547224 -0.210439 0.015695 0.069563 0.390518 0.155079 0.031377 -0.034256 0.005928 -0.134624 -0.116676 -0.105345
polarizability: 1.66885446e+02 -6.14039012e-01 1.26739311e+02 2.48487445e-01 1.08731207e+00 1.15007929e+02
1716.lowfreq: -0.0011 -0.0006 0.0007 11.5899 15.3545 25.3532 72.2206 97.1746 150.0129
frequency: 72.1597 97.1536 149.9707 158.4301 195.3773 206.0649 219.0075 227.9524 268.8829 289.8018 322.9296 328.7136 346.9256 378.7581 386.8071 436.1215 451.0548 486.9853 511.3898 526.7661 548.1556 610.9693 637.5939 718.4558 739.8411 786.3031 813.4125 826.3900 832.3591 861.6782 868.4059 881.1859 919.8275 945.7790 946.8388 954.3468 974.9452 984.5305 1008.3245 1019.0779 1049.8692 1077.2897 1099.2937 1107.8763 1124.5572 1141.4847 1152.7837 1187.4170 1202.1633 1209.7829 1213.8953 1225.1316 1243.9384 1246.9055 1268.1575 1282.9447 1289.9002 1303.2001 1315.6887 1342.0187 1363.9018 1388.6572 1405.2402 1426.9012 1467.8271 1470.6500 1487.3289 1491.2166 1506.1752 1509.6212 2977.1572 2982.3042 3008.0841 3015.4566 3028.9015 3033.1578 3045.2743 3059.4180 3060.4491 3063.9843 3065.7458 3066.1443 3076.6337 3092.8072 3106.1727 3154.6876 3407.7267
redmass: 6.1051 3.1915 2.5910 1.6011 3.7512 1.7279 3.7053 2.1453 3.2359 3.7986 2.8635 2.9157 1.8320 3.3621 5.1935 3.5071 2.9387 3.0589 4.6445 4.3772 4.9541 3.3606 3.7100 2.8692 2.3523 1.9735 2.3954 2.6263 8.0591 2.1478 2.1800 2.5952 2.0250 2.0051 1.4424 3.2860 2.0572 1.8364 2.5255 1.5942 1.7116 2.4429 1.1497 1.6702 1.4109 1.5456 1.9641 2.1604 1.2934 1.3287 1.7643 1.6466 1.4848 1.4970 1.4176 1.3526 1.5546 1.7979 1.4610 1.3286 1.2774 1.2029 1.1853 1.1092 1.0524 1.0526 1.0653 1.0615 1.0629 1.0779 1.0369 1.0385 1.0854 1.0618 1.0662 1.0809 1.0865 1.0990 1.0858 1.0726 1.0952 1.0943 1.0975 1.1032 1.0957 1.1115 1.0761
irintensity: 4.5960 1.5718 0.3720 0.5835 0.8660 0.1010 4.2172 1.6634 0.6329 12.7773 11.6562 4.6837 0.1982 7.1602 60.9154 12.9370 2.5934 0.3080 23.4321 14.1096 16.3958 2.3135 25.0930 6.7298 6.0264 19.5099 5.4420 33.9480 82.5701 8.3713 2.8920 2.3150 4.9789 14.0437 5.0036 58.8131 5.7058 11.4549 4.4801 2.6407 2.8819 13.1264 9.9393 5.0672 6.0567 3.2254 3.0646 0.8764 0.9579 0.9994 1.7566 2.8318 0.5261 2.5599 3.8934 5.3761 5.6043 1.4355 17.0451 3.2495 4.0644 12.8543 19.7026 16.8602 4.5907 8.7139 8.8734 13.2715 8.3490 21.8202 25.3412 49.0570 13.7518 14.3281 20.5661 39.0528 45.3694 0.5198 15.1850 11.8172 57.4740 17.2036 52.0690 27.6658 27.7261 0.3071 17.0008
temp: 298.150 k
press: 1.00000 atm
elementType: 16 8 8 7 6 6 6 6 6 6 6 6 6 6 1 1 1 1 1 1 1 1 1 1 1 1 1 1 1 1 1
symmnumber: 1
zpe: 680589.0 jmol-1
zpe.correction: 0.259223 hartree
zpe.thermalcorrener: 0.272819 hartree
zpe.thermalcorrenthalpy: 0.273763 hartree
zpe.thermalcorrgfe: 0.220556 hartree
zpe.sumelectzpe: -993.236179 hartree
zpe.sumelectthermal: -993.222583 hartree
zpe.sumelectthermalent: -993.221639 hartree
zpe.sumelectthermalfe: -993.274846 hartree
dipole: -6.0942 -3.1740 1.4488
dipole: 7.0223
quadrupole: -113.1259 -94.3805 -88.0612
quadrupole: -3.7933 2.3785 1.8075
quadrupole: -14.6034 4.1420 10.4613 -3.7933 2.3785 1.8075
hfenergy: -993.4954022 hartree
pointgroup: C01 [X(C10H17N1O2S1)]
dipole: 2.3649965 1.3273705 0.5270908 debye
polarizability: 166.8894924|0.1871695|126.5580835|0.5417202|-1.7822926|115.1851106 unknown
InChI: InChI=1S/C10H17NO2S/c1-10(2)7-3-4-8(10)9-6(7)5-14(12,13)11-9/h6-9,11H,3-5H2,1-2H3
charge 0 multiplicity 1
31 atoms
S  -2.561041 -0.090056 -0.044793
O  -2.679836 -1.701192 0.078558
O  -3.914919 0.793594 -0.245049
N  -1.348567 0.389369 -1.401474
C  1.122646 -0.057902 1.142639
C  1.139751 -0.122315 -1.134122
C  2.162426 0.259918 -0.000745
C  -0.054362 0.903406 0.783996
C  -0.059852 0.837601 -0.841884
C  0.70086 -1.524052 0.820917
C  0.709301 -1.564251 -0.751623
C  -1.408015 0.598024 1.404851
C  2.66676 1.727174 -0.041322
C  3.421755 -0.639397 0.034898
H  1.49794 0.092479 2.17012
H  1.511667 -0.01695 -2.167037
H  0.207124 1.938499 1.062787
H  0.152737 1.847769 -1.237809
H  -0.292072 -1.790967 1.222368
H  1.418506 -2.239484 1.257894
H  1.424854 -2.308083 -1.140682
H  -0.281441 -1.809061 -1.167229
H  -1.42518 -0.207678 2.152126
H  -1.969454 1.484168 1.735733
H  -1.857628 1.106163 -1.946655
H  3.278738 1.945804 0.854181
H  3.312241 1.879711 -0.926537
H  1.868002 2.486909 -0.086945
H  4.038768 -0.398689 0.921464
H  3.191209 -1.715395 0.069045
H  4.044179 -0.458915 -0.861569
