program: Gaussian 09
title: 000146141
version: EM64L-G09RevD.01
frameworkgroup: C1[X(C19H26O2S)]
method: RPBEPBE
basis: SDD
operation: Freq
keyword: #p
keyword: freq=noraman
keyword: PBEPBE/SDD
title: #p freq=noraman PBEPBE/SDD
converged: NO YES NO NO
title: Mulliken charges:
elementType: S O O C C C C C C C C C C C C C C C C C C C H H H H H H H H H H H H H H H H H H H H H H H H H H
charge: -0.012371 -0.176251 -0.229740 -0.108210 -0.119564 -0.157975 0.310890 0.292376 -0.521632 -0.525323 -0.486732 -0.537553 0.506384 -0.626454 0.043806 -0.511042 -0.492294 -0.793668 -0.904975 -0.552558 -0.545281 0.175354 0.215728 0.225843 0.222825 0.220905 0.217202 0.218799 0.228520 0.225576 0.221862 0.235913 0.217854 0.244254 0.228941 0.250541 0.249153 0.206447 0.247031 0.244515 0.227249 0.230834 0.277733 0.281654 0.230198 0.245768 0.254612 0.102853
chargesum: 0.00000
title: Mulliken charges with hydrogens summed into heavy atoms:
elementType: S O O C C C C C C C C C C C C C C C C C C C
charge: 0.090482 -0.176251 -0.229740 0.107518 0.106279 0.064850 0.310890 0.292376 -0.083524 -0.078004 -0.039294 -0.083786 0.506384 -0.153258 0.043806 -0.011348 -0.038816 -0.091070 -0.345587 -0.076592 -0.290669 0.175354
polarizability: 2.58824181e+02 1.19200360e+01 2.00408194e+02 -1.93221288e+00 4.99077183e-01 1.91255951e+02
1716.lowfreq: 0.0005 0.0006 0.0013 5.8154 7.0503 13.7506 36.2841 48.4398 59.3483
frequency: 36.2712 48.3597 59.3385 88.3820 90.5803 126.6839 137.3006 156.5722 162.1542 167.5151 183.7707 192.3985 214.6306 223.6399 257.2261 275.7346 285.1649 295.5189 303.2457 338.6630 357.9105 370.1751 387.2706 405.2019 416.2529 463.2314 466.7511 484.2989 508.1500 527.6197 538.2873 561.1059 572.1454 583.3979 619.8413 641.0260 665.0318 678.7880 703.8274 753.3581 775.2348 801.2316 818.7393 825.7943 833.5814 839.1049 861.2268 885.2344 895.7445 906.2843 916.5738 933.6702 945.0252 968.9142 982.4262 988.2355 997.3316 1004.6694 1016.4087 1033.1727 1045.6870 1061.9673 1066.3315 1072.9907 1079.6322 1088.4969 1105.1818 1118.2257 1132.8453 1146.7744 1158.4916 1166.3822 1178.0380 1188.6478 1196.7330 1207.2848 1220.3138 1237.8823 1243.8721 1244.7114 1256.6100 1263.0065 1274.5368 1276.9158 1279.8758 1290.0353 1299.0743 1308.3877 1319.4020 1321.3768 1325.5263 1327.7595 1337.4612 1345.2000 1347.1494 1356.8769 1371.7813 1381.7393 1429.0967 1445.9518 1446.8714 1459.9081 1463.3180 1470.8036 1472.0342 1478.8038 1481.5994 1488.5387 1493.0399 1588.1957 1629.5894 1656.0961 2435.2216 2906.6740 2933.1734 2963.4921 2972.4765 2975.4167 2980.0783 2982.3271 2987.3225 2991.1771 2993.8198 2999.8528 3006.1223 3031.2705 3034.4910 3041.7540 3047.9476 3052.1561 3058.0267 3058.5115 3065.8618 3072.9191 3079.5827 3082.2276 3104.6200 3120.7536
redmass: 8.0724 4.0307 7.0001 5.3233 3.8831 4.3153 3.7278 2.0276 3.4124 1.1453 1.9452 2.6065 2.4550 2.6782 2.7627 2.2329 3.7639 2.6956 2.6094 2.9834 2.8432 2.6065 3.0933 2.9159 3.6212 3.6416 3.0347 3.6417 2.8411 2.6412 2.3100 3.2192 3.9837 2.6689 4.2825 3.8793 3.2289 3.3105 2.9945 2.5348 2.8412 2.0199 1.9352 1.8102 2.0632 1.5583 1.8319 1.8632 1.6695 1.6063 2.0336 1.8822 2.1065 2.0061 2.0961 2.0595 1.8919 1.8453 2.2992 1.8709 2.6229 2.3564 2.7002 2.7912 1.9129 1.7289 2.1171 1.8416 1.9268 1.6397 2.0591 1.6187 1.4907 1.6672 1.5363 1.5605 1.7594 1.8743 1.4591 1.4908 1.7395 1.4321 1.2804 1.3498 2.0439 1.4471 1.2834 1.3487 1.3264 1.4668 1.3023 1.5432 1.4346 1.5668 2.0939 1.4617 1.4149 1.1889 1.0795 1.0833 1.0955 1.0741 1.0884 1.0840 1.0723 1.0880 1.0942 1.0698 1.0723 9.9776 7.8046 12.0777 1.0384 1.0811 1.0810 1.0687 1.0743 1.0665 1.0616 1.0513 1.0479 1.0620 1.0610 1.0599 1.0656 1.0594 1.0981 1.0959 1.1000 1.0991 1.0987 1.1018 1.0951 1.1020 1.0990 1.0996 1.1069 1.0913
irintensity: 3.5274 0.4271 2.4452 4.0268 2.1382 3.2404 1.2445 0.8264 2.8343 20.6086 0.7411 0.7630 1.8358 0.7052 0.2047 0.0937 3.4365 1.1035 0.9114 1.4283 2.3672 1.2044 1.4769 2.2466 2.1014 0.8916 1.4172 2.3696 1.7198 2.8349 0.8513 3.3569 3.7682 3.3333 0.7593 1.0660 2.6015 10.4295 6.9675 10.3091 4.3314 0.5099 9.2719 3.0049 4.1595 1.0915 12.3869 12.5701 9.7554 7.4110 8.8742 2.6469 1.9881 12.7421 5.1511 6.0649 9.9371 10.6077 30.1234 8.6594 12.6552 0.2258 6.1898 1.1816 2.3996 11.5852 1.2198 12.8632 8.7516 2.2411 4.8183 10.9234 7.2071 19.6825 0.9867 4.0303 12.0217 13.7541 25.1965 4.8139 3.0491 1.8270 4.6039 3.0153 25.5037 0.1645 2.3790 4.1323 2.3946 5.0429 3.4899 13.6659 0.9491 1.0173 6.1924 2.4764 7.3761 20.8636 19.0813 14.3030 7.8790 6.4240 7.7196 11.4395 3.6321 13.7238 17.0233 7.4354 9.6523 184.0317 167.5787 189.9112 39.2140 11.6632 8.5351 15.3412 27.6636 14.4885 25.7253 8.8394 37.1932 18.9030 30.5319 23.2587 13.9782 16.1524 46.9424 21.7649 49.0238 33.8870 6.6452 35.2752 19.8372 38.7668 21.6945 26.9275 14.8807 8.2711
temp: 298.150 k
press: 1.00000 atm
elementType: 16 8 8 6 6 6 6 6 6 6 6 6 6 6 6 6 6 6 6 6 6 6 1 1 1 1 1 1 1 1 1 1 1 1 1 1 1 1 1 1 1 1 1 1 1 1 1 1
symmnumber: 1
zpe: 1065871.2 jmol-1
zpe.correction: 0.405969 hartree
zpe.thermalcorrener: 0.426856 hartree
zpe.thermalcorrenthalpy: 0.427800 hartree
zpe.thermalcorrgfe: 0.357613 hartree
zpe.sumelectzpe: -1286.439936 hartree
zpe.sumelectthermal: -1286.419049 hartree
zpe.sumelectthermalent: -1286.418105 hartree
zpe.sumelectthermalfe: -1286.488292 hartree
dipole: 3.1390 4.3365 1.1263
dipole: 5.4705
quadrupole: -186.9878 -144.5058 -134.6954
quadrupole: -8.8337 15.6031 -3.7508
quadrupole: -31.5915 10.8905 20.7009 -8.8337 15.6031 -3.7508
hfenergy: -1286.845905 hartree
pointgroup: C01 [X(C19H26O2S1)]
dipole: -1.3528536 0.2715117 1.6517765 debye
polarizability: 260.2296164|2.5794855|191.2005183|-7.4076988|-0.1854079|199.0581907 unknown
InChI: InChI=1S/C19H26O2S/c1-18-8-7-16-14(15(18)4-5-17(18)21)3-2-12-10-13(20)6-9-19(12,16)11-22/h10,14-16,22H,2-9,11H2,1H3
charge 0 multiplicity 1
48 atoms
S  3.243819 -0.375032 2.92785
O  -4.951252 -1.057533 -1.205239
O  4.745141 0.35301 -2.3251
C  -0.666348 0.757721 0.506434
C  0.176095 -0.446633 -0.054798
C  -2.024197 0.751772 -0.224802
C  -2.8198 -0.5695 0.001875
C  1.654019 -0.480324 0.542673
C  -0.593964 -1.795395 0.074913
C  -2.010875 -1.753385 -0.564656
C  0.06724 2.110844 0.351842
C  -3.070242 1.872138 0.022311
C  2.236608 0.918295 0.280961
C  1.508124 2.06734 0.942549
C  -4.152638 -0.235318 -0.697605
C  -4.346698 1.299081 -0.660732
C  2.550796 -1.576228 -0.10975
C  -3.210197 -0.826595 1.493426
C  1.584003 -0.779882 2.070951
C  3.048125 -1.228684 -1.526594
C  3.238448 1.145401 -0.628069
C  3.781776 0.112668 -1.535464
H  -0.851259 0.59728 1.589307
H  0.301493 -0.248864 -1.143551
H  -1.790755 0.785033 -1.315658
H  -0.681038 -2.080242 1.141838
H  -0.018881 -2.602421 -0.415287
H  -1.917981 -1.639238 -1.663377
H  -2.536223 -2.71053 -0.388016
H  -0.513284 2.911089 0.849424
H  0.131724 2.374903 -0.723902
H  -2.766383 2.83954 -0.412692
H  -3.235004 2.034688 1.103999
H  1.457925 1.934302 2.040263
H  2.028759 3.022067 0.749008
H  -4.443645 1.653451 -1.705405
H  -5.294829 1.556473 -0.155192
H  2.014934 -2.542655 -0.120353
H  3.433913 -1.714358 0.543834
H  -3.836664 -1.734723 1.551841
H  -2.321318 -0.983442 2.12821
H  -3.787088 0.008604 1.929315
H  1.387086 -1.853262 2.226903
H  0.80417 -0.190037 2.57546
H  2.200157 -1.15415 -2.238815
H  3.726194 -2.007121 -1.918109
H  3.637949 2.158415 -0.768168
H  2.948368 -1.054265 4.10035
