program: Gaussian 09
title: 000145219
version: EM64L-G09RevD.01
frameworkgroup: C1[X(C16H24)]
method: RPBEPBE
basis: SDD
operation: Freq
keyword: #p
keyword: freq=noraman
keyword: PBEPBE/SDD
title: #p freq=noraman PBEPBE/SDD
converged: NO YES NO NO
title: Mulliken charges:
elementType: C C C C C C C C C C C C C C C C H H H H H H H H H H H H H H H H H H H H H H H H
charge: 0.022059 0.028897 -0.484356 -0.461070 -0.441163 -0.470180 -0.434895 -0.430868 -0.571849 -0.572769 0.481054 0.484112 -0.641140 -0.651523 -0.412830 -0.421179 0.181494 0.168196 0.188764 0.192034 0.187573 0.187002 0.256045 0.182927 0.187526 0.256396 0.194439 0.186176 0.195335 0.193234 0.208546 0.205573 0.207617 0.201061 0.224181 0.219530 0.227260 0.217023 0.254602 0.255167
chargesum: 0.00000
title: Mulliken charges with hydrogens summed into heavy atoms:
elementType: C C C C C C C C C C C C C C C C
charge: 0.203553 0.197093 -0.103557 -0.086495 -0.002192 -0.026258 -0.054280 -0.042300 -0.157730 -0.164090 0.481054 0.484112 -0.197429 -0.207240 -0.158228 -0.166013
polarizability: 1.63778054e+02 -6.94910811e+00 1.57989104e+02 3.78354085e+00 -6.12975170e+00 1.48748276e+02
1716.lowfreq: -19.6096 -10.3271 -0.0005 -0.0004 0.0008 19.2493 91.9046 133.9576 152.8779
frequency: 91.8386 133.9136 152.8736 166.1179 189.1490 207.1444 232.8736 238.9904 281.7129 290.7123 306.0719 338.8934 359.4148 378.3764 392.9740 420.1549 449.4965 480.9437 490.5614 510.3701 545.9616 584.1664 630.6321 655.0094 701.1494 732.4310 762.0837 779.8241 788.8015 801.8441 813.9980 859.3411 866.2584 889.0458 895.1691 915.9694 917.9397 929.4705 941.0764 958.1037 971.0707 999.0798 1010.9006 1029.3557 1044.4565 1060.2688 1077.2931 1088.3767 1105.0858 1112.7842 1116.1050 1126.0435 1139.2684 1155.6881 1174.4690 1184.1887 1194.0422 1203.2342 1223.8819 1235.8443 1244.7271 1258.5480 1264.1910 1276.7529 1287.1430 1295.8208 1306.6540 1313.7200 1317.7932 1323.7252 1331.4903 1341.4959 1346.3551 1348.8367 1354.0994 1362.0731 1366.9394 1372.4770 1450.7234 1455.5725 1456.4366 1459.0721 1460.4086 1465.5431 1468.9921 1472.2580 1473.8122 1479.0337 1640.9580 1677.9272 2921.0324 2930.7828 2938.3839 2943.6030 2947.4849 2953.3540 2956.6394 2957.6271 2970.5059 2973.0214 2974.2998 2982.3734 2994.8829 3002.6001 3004.6483 3007.9456 3018.6788 3027.5732 3042.3775 3045.5894 3094.3602 3110.4196 3125.4680 3135.3428
redmass: 2.6544 2.6839 3.3377 3.1716 3.3791 2.0484 2.7141 2.3444 2.3419 2.0173 2.5806 1.8798 1.9923 2.4109 2.5168 2.1817 2.8394 2.9726 2.7726 3.2292 2.9734 2.8289 3.2379 2.6574 2.7238 2.5118 1.5482 2.6792 1.7090 1.7082 1.4462 2.3567 2.2378 1.9033 2.1679 2.2579 1.6471 1.7256 2.1156 2.2351 2.1657 2.3264 2.4673 2.4457 2.2258 2.0633 2.1922 1.7971 1.7892 1.4602 1.5089 1.4271 1.6187 1.1488 2.4173 1.3607 1.2754 1.2802 1.3549 1.3563 1.2687 1.2701 1.3144 1.3580 1.3130 1.5080 1.3662 1.4143 1.4779 1.2987 1.3379 1.3816 1.4713 1.4204 1.3980 1.3601 1.3753 1.3661 1.0849 1.0845 1.0830 1.0868 1.0919 1.0857 1.0828 1.0936 1.0803 1.0884 6.0740 7.0929 1.0810 1.0743 1.0674 1.0648 1.0623 1.0672 1.0641 1.0649 1.0639 1.0697 1.0673 1.0721 1.0938 1.0989 1.1003 1.0986 1.0980 1.0986 1.0927 1.0928 1.0880 1.0869 1.0932 1.0932
irintensity: 0.1437 0.1433 0.3010 0.2009 0.3561 0.2287 0.7941 0.0633 1.0434 0.6899 0.7876 0.0210 0.4690 0.8497 0.3468 1.7964 0.7440 5.8211 2.7584 3.3274 1.6814 4.4949 3.6118 2.9015 1.6261 0.3696 0.8239 5.7990 7.8731 4.5911 33.3070 8.3209 0.3738 14.3686 7.7551 10.1652 2.3365 7.2466 4.2780 5.6213 4.2573 2.2608 1.4505 1.4241 0.2674 0.1246 2.6342 0.1949 0.0943 0.8745 0.7434 0.8906 0.7568 2.1530 3.1369 0.0427 1.1813 1.4118 2.1324 5.4130 1.2651 0.9356 0.7005 2.1335 6.1557 2.1911 1.1834 0.2871 3.8652 0.0691 2.8636 2.3684 0.1203 0.5717 0.5435 0.3339 0.4187 2.0398 2.8827 1.8779 6.1391 11.9789 18.5811 10.9633 18.5058 0.1892 18.2299 3.9797 7.9142 8.1555 32.1598 3.0007 46.7408 20.5386 25.2920 21.7770 70.3073 18.4583 21.1233 114.9775 166.7772 64.8162 38.7437 31.0520 24.2741 30.7419 61.2453 41.6828 42.1314 26.2294 17.1538 34.5996 21.1257 14.6179
temp: 298.150 k
press: 1.00000 atm
elementType: 6 6 6 6 6 6 6 6 6 6 6 6 6 6 6 6 1 1 1 1 1 1 1 1 1 1 1 1 1 1 1 1 1 1 1 1 1 1 1 1
symmnumber: 1
zpe: 945437.9 jmol-1
zpe.correction: 0.360098 hartree
zpe.thermalcorrener: 0.374129 hartree
zpe.thermalcorrenthalpy: 0.375073 hartree
zpe.thermalcorrgfe: 0.321622 hartree
zpe.sumelectzpe: -622.795162 hartree
zpe.sumelectthermal: -622.781131 hartree
zpe.sumelectthermalent: -622.780187 hartree
zpe.sumelectthermalfe: -622.833637 hartree
dipole: -0.5110 -0.3117 -0.0854
dipole: 0.6046
quadrupole: -99.8837 -98.9577 -96.9997
quadrupole: -1.7889 0.7701 -1.2687
quadrupole: -1.2700 -0.3440 1.6140 -1.7889 0.7701 -1.2687
hfenergy: -623.1552598 hartree
pointgroup: C01 [X(C16H24)]
dipole: -0.2183531 0.0885157 0.0327302 debye
polarizability: 161.3177766|7.4024572|160.0794175|-2.9746385|-6.9939875|149.1182392 unknown
InChI: InChI=1S/C16H24/c1-2-14-4-3-13(1)9-10-15-5-7-16(8-6-15)12-11-14/h1,4,15-16H,2-3,5-12H2
charge 0 multiplicity 1
40 atoms
C  -2.61495 -0.18302 -0.166222
C  -0.483635 2.023921 0.232521
C  -2.19687 0.819095 -1.288983
C  -2.340053 0.486204 1.211211
C  -0.77516 1.417248 -1.16362
C  -0.903402 1.039776 1.366474
C  -2.153469 -1.689267 -0.340967
C  0.993359 2.545098 0.391395
C  -0.968683 -2.307252 0.471449
C  2.161833 1.79987 -0.35225
C  0.441825 -1.89701 0.06327
C  2.191047 0.287225 -0.137039
C  1.531894 -1.736607 1.143977
C  2.079487 -0.668874 -1.34107
C  0.787534 -1.472726 -1.181097
C  2.046722 -0.29683 1.083122
H  -3.720978 -0.250167 -0.254587
H  -1.141304 2.91651 0.342512
H  -2.928936 1.655132 -1.264711
H  -2.310497 0.337592 -2.281836
H  -2.559541 -0.219805 2.037836
H  -3.058533 1.326331 1.322682
H  -0.04187 0.623705 -1.365978
H  -0.637188 2.193855 -1.944335
H  -0.81745 1.562686 2.341572
H  -0.192478 0.202577 1.396364
H  -1.98272 -1.871846 -1.421327
H  -3.034263 -2.310826 -0.078423
H  1.227725 2.57282 1.475435
H  1.03374 3.599306 0.046477
H  -1.079771 -3.412114 0.416165
H  -1.104587 -2.059997 1.543912
H  3.109439 2.276207 -0.024496
H  2.082657 2.003441 -1.437401
H  2.351213 -2.460104 0.939448
H  1.147424 -1.970545 2.153093
H  2.963993 -1.342497 -1.350772
H  2.084372 -0.1230 -2.301146
H  0.096139 -1.529176 -2.028426
H  2.079235 0.288263 2.00937
