program: Gaussian 09
title: 000145579
version: EM64L-G09RevD.01
frameworkgroup: C1[X(C11H22N6O2)]
method: RPBEPBE
basis: SDD
operation: Freq
keyword: #p
keyword: freq=noraman
keyword: PBEPBE/SDD
title: #p freq=noraman PBEPBE/SDD
converged: YES YES NO NO
title: Mulliken charges:
elementType: O O N N N N N N C C C C C C C C C C C H H H H H H H H H H H H H H H H H H H H H H
charge: -0.334114 -0.334107 -0.120117 -0.120044 -0.152615 -0.169677 -0.152558 -0.169725 -0.316375 -0.329898 -0.312074 -0.329978 -0.312016 0.282923 0.282877 -0.625390 -0.623019 -0.625422 -0.622998 0.199568 0.199529 0.201161 0.269732 0.227711 0.198241 0.201158 0.269782 0.227724 0.198211 0.217298 0.225240 0.283111 0.213779 0.286845 0.219476 0.283106 0.217301 0.225274 0.213781 0.286845 0.219458
chargesum: 0.00000
title: Mulliken charges with hydrogens summed into heavy atoms:
elementType: O O N N N N N N C C C C C C C C C C C
charge: -0.334114 -0.334107 -0.120117 -0.120044 -0.152615 -0.169677 -0.152558 -0.169725 0.082721 0.140995 0.113878 0.140961 0.113919 0.282923 0.282877 0.100259 0.097081 0.100259 0.097086
polarizability: 1.92973472e+02 1.36278610e-02 1.65696349e+02 -2.04057172e+01 1.42565543e-03 1.39984888e+02
1716.lowfreq: -1.3346 -0.0008 -0.0004 0.0004 6.9328 17.0489 23.3874 25.5224 28.7670
frequency: 23.1021 25.4475 28.7292 66.2036 78.3401 106.7321 106.8028 112.1235 124.8615 139.8768 140.7188 160.0075 163.6968 203.3275 208.2978 216.4283 222.3583 227.8182 282.6817 285.8631 291.0310 341.2757 343.9390 377.0463 382.8888 435.2296 440.5032 472.3078 513.8339 560.5296 573.6125 591.8760 636.2616 694.1559 694.5045 772.2775 791.6927 880.7211 888.1527 934.7174 943.6140 1018.7763 1020.8350 1022.0026 1040.6822 1048.6445 1060.1555 1062.9945 1088.4158 1090.8008 1121.0700 1122.9383 1124.4820 1128.5876 1138.2118 1139.9347 1161.6488 1186.4451 1189.9347 1205.1572 1251.9965 1255.0707 1261.3659 1267.8777 1271.2218 1283.9815 1290.8795 1301.9196 1310.4962 1314.4019 1335.9334 1372.1354 1399.0021 1412.1371 1412.5191 1413.8257 1418.9188 1427.9802 1444.7935 1446.2783 1475.4775 1479.3471 1482.8685 1483.2008 1483.6179 1486.8907 1487.0737 1488.1317 1489.6550 1499.6201 1500.2158 1518.8601 1519.3103 1601.7299 1603.9145 2784.4081 2784.5101 2800.3598 2800.7183 2850.2993 2884.7132 2951.4125 2951.5880 2958.4429 2958.4933 2981.6988 2981.8020 3020.0133 3020.0375 3029.1428 3029.6079 3052.7708 3053.7810 3113.6864 3113.6905 3114.6063 3114.6186
redmass: 3.9937 4.0845 4.7230 3.1119 2.3688 2.3626 2.3837 2.8212 6.2458 1.2544 1.3322 1.3190 1.1940 3.1088 3.2023 2.4082 4.1597 2.6316 2.0304 2.4261 2.6034 2.3037 1.9688 3.8466 3.9402 5.7032 4.9176 6.4284 5.3785 4.5367 5.0343 4.2862 4.3379 11.5825 11.4776 4.7885 4.3369 5.0916 4.2109 3.1652 3.4819 1.8777 1.5265 1.5869 1.7909 1.7038 1.9089 1.7945 2.0043 1.9846 1.6696 1.3134 1.3094 1.4389 1.5258 1.6304 2.4415 1.5299 1.2628 2.4205 2.6600 3.4348 2.0408 2.8336 2.6605 1.9492 1.6724 1.6906 2.9732 3.2735 1.7875 1.4171 1.4408 1.2814 1.2535 1.2271 1.2653 1.4158 1.4320 1.4615 1.0761 1.0742 1.0725 1.0710 1.0641 1.0583 1.0534 1.0573 1.0801 1.1030 1.0994 1.4548 1.4177 6.3157 6.4540 1.0714 1.0717 1.0709 1.0705 1.0543 1.1031 1.0374 1.0374 1.0370 1.0370 1.0859 1.0860 1.1019 1.1019 1.1015 1.1016 1.0881 1.0883 1.0953 1.0953 1.0958 1.0958
irintensity: 2.4418 0.0498 1.2057 0.1282 0.0120 3.3633 12.6950 1.0132 0.2435 0.0022 0.0164 3.5846 0.8174 0.7308 1.3598 0.0773 1.3578 1.0192 3.2395 3.3882 2.3108 0.3851 23.7443 19.2915 29.7166 5.7565 7.6082 26.1792 4.4621 1.1162 1.7498 4.1743 0.6873 33.0322 0.4538 4.2898 5.3529 14.5192 46.8745 9.9438 7.9858 6.6792 0.0357 0.6506 15.9418 18.1983 10.9587 6.1667 12.0373 75.1187 216.2044 10.3047 26.4068 22.6136 98.5664 21.8406 0.0000 78.4126 53.6809 2.8958 11.5026 41.7170 1.7703 2.5185 42.9668 16.2356 40.7718 90.4435 51.7212 8.1240 75.1901 132.0634 21.1378 10.2576 27.6060 105.3493 58.8935 27.7668 217.5566 145.6398 5.4579 1.7564 6.6450 15.8098 0.8317 44.6462 3.3496 13.9660 2.8827 1.8802 1.3644 132.6261 107.7954 430.9296 229.6383 125.9226 27.4112 212.5294 88.1515 158.5213 72.5649 138.6865 94.4628 76.1874 47.3307 32.6370 73.8731 17.6728 75.4406 76.7898 15.9489 8.8159 5.3146 0.3692 0.2246 1.1034 1.7339
temp: 298.150 k
press: 1.00000 atm
elementType: 8 8 7 7 7 7 7 7 6 6 6 6 6 6 6 6 6 6 6 1 1 1 1 1 1 1 1 1 1 1 1 1 1 1 1 1 1 1 1 1 1
symmnumber: 1
zpe: 904965.1 jmol-1
zpe.correction: 0.344683 hartree
zpe.thermalcorrener: 0.365579 hartree
zpe.thermalcorrenthalpy: 0.366524 hartree
zpe.thermalcorrgfe: 0.293300 hartree
zpe.sumelectzpe: -909.798227 hartree
zpe.sumelectthermal: -909.777331 hartree
zpe.sumelectthermalent: -909.776387 hartree
zpe.sumelectthermalfe: -909.849610 hartree
dipole: 0.0012 -6.5602 0.0013
dipole: 6.5602
quadrupole: -151.0134 -110.6396 -106.9657
quadrupole: 0.0044 -1.7341 0.0038
quadrupole: -28.1405 12.2333 15.9072 0.0044 -1.7341 0.0038
hfenergy: -910.1429101 hartree
pointgroup: C01[X(C11H22N6O2)]
dipole: -0.0044246 2.5809792 0.0056305 debye
polarizability: 192.3984914|-0.0130257|165.6960549|21.1311925|0.1011145|140.5601631 unknown
InChI: InChI=1S/C11H22N6O2/c1-12-5-16(6-13(2)10(12)18)9-17-7-14(3)11(19)15(4)8-17/h5-9H2,1-4H3
charge 0 multiplicity 1
41 atoms
O  4.492338 -1.459665 0.002833
O  -4.48461 -1.476967 -0.010754
N  1.198148 0.904863 0.013445
N  -1.199254 0.899996 -0.012065
N  2.447334 -0.881432 -0.982876
N  3.532169 0.61502 0.510434
N  -2.440934 -0.896062 0.976144
N  -3.532641 0.603865 -0.508609
C  -0.002272 1.75015 0.002636
C  1.403143 0.119897 -1.216384
C  2.434064 1.587464 0.415091
C  -1.400612 0.108221 1.214043
C  -2.43805 1.579893 -0.409536
C  3.542473 -0.624745 -0.151508
C  -3.53767 -0.639351 0.146918
C  2.375668 -2.146955 -1.720273
C  4.689532 1.00228 1.322329
C  -2.363462 -2.165306 1.706526
C  -4.692322 0.991053 -1.317226
H  -0.06887 2.417547 -0.89322
H  0.061587 2.413638 0.901589
H  1.680255 0.78466 -2.080005
H  0.451586 -0.38174 -1.461014
H  2.277031 2.054499 1.40825
H  2.719571 2.408628 -0.299231
H  -1.679954 0.767714 2.080984
H  -0.446974 -0.390807 1.455825
H  -2.283543 2.052194 -1.400602
H  -2.725988 2.396606 0.3089
H  2.398059 -1.97849 -2.815385
H  1.450732 -2.700106 -1.465904
H  3.251084 -2.751269 -1.437144
H  5.146939 1.94023 0.947657
H  5.42976 0.19021 1.260097
H  4.402653 1.146726 2.383116
H  -3.237491 -2.770985 1.422023
H  -2.384028 -2.002758 2.802557
H  -1.437278 -2.714066 1.447211
H  -5.153049 1.925121 -0.936952
H  -5.429299 0.175753 -1.258758
H  -4.407032 1.142475 -2.377466
