program: Gaussian 09
title: 000144908
version: EM64L-G09RevD.01
frameworkgroup: C1[X(C15H20)]
method: RPBEPBE
basis: SDD
operation: Freq
keyword: #p
keyword: freq=noraman
keyword: PBEPBE/SDD
title: #p freq=noraman PBEPBE/SDD
converged: YES YES NO NO
title: Mulliken charges:
elementType: C C C C C C C C C C C C C C C H H H H H H H H H H H H H H H H H H H H
charge: 0.329062 -0.417289 -0.450697 -0.418577 -0.726744 -0.734095 -0.726823 0.087295 -0.212326 0.358924 -0.403371 -0.407118 -0.228590 -0.226800 -0.250462 0.203451 0.200596 0.219035 0.219064 0.204676 0.200368 0.212551 0.240763 0.217018 0.219948 0.223761 0.223301 0.240777 0.212766 0.217082 0.245419 0.244944 0.226800 0.226692 0.228599
chargesum: 0.00000
title: Mulliken charges with hydrogens summed into heavy atoms:
elementType: C C C C C C C C C C C C C C C
charge: 0.329062 -0.013241 -0.012597 -0.013532 -0.056412 -0.067085 -0.056198 0.087295 -0.212326 0.358924 -0.157952 -0.162175 -0.001791 -0.000109 -0.021863
polarizability: 2.49749670e+02 6.55810708e-02 1.16668696e+02 -2.08650810e+00 -7.33131867e+00 1.42307431e+02
1716.lowfreq: -13.0149 -4.2129 -0.0003 0.0006 0.0006 6.2936 8.3907 38.2945 47.0725
frequency: 5.5846 38.2029 47.0531 72.0346 98.3111 117.1610 121.5400 145.0881 183.7809 215.4095 230.1403 262.2741 263.8355 308.4804 315.6375 319.8097 384.2708 402.5273 410.0454 464.5702 500.7075 529.0433 532.7490 574.3285 618.2179 636.0886 698.4894 734.2205 749.2944 774.5863 791.0553 803.9849 854.3258 905.5088 907.7283 926.0641 944.8392 979.2397 986.4594 996.3618 1017.1692 1021.2453 1026.4223 1044.1684 1055.5999 1073.8582 1077.4926 1087.5150 1149.4590 1165.6467 1171.8707 1177.9453 1186.0858 1255.0898 1262.6947 1275.4782 1301.9967 1310.4706 1317.8451 1336.9603 1346.8424 1367.5242 1390.1369 1390.7736 1394.1318 1432.9664 1457.1074 1462.6661 1474.2227 1476.6754 1480.7142 1481.6661 1485.6094 1487.1743 1489.6250 1495.6884 1574.6247 1609.2022 2244.5492 2976.1922 2979.6149 2980.6391 2981.6212 2984.4237 2997.6306 3025.9538 3032.6792 3040.9281 3072.2069 3072.5333 3073.3684 3078.1133 3080.6534 3081.4783 3125.1041 3133.3388 3147.3495 3155.9572 3167.5976
redmass: 3.5640 3.7675 3.6063 2.4102 2.4013 2.5066 3.9187 1.6897 2.3768 1.4500 1.0507 2.2250 1.7976 2.6730 2.1431 2.9391 3.3987 2.8515 3.4523 5.8712 3.3065 4.2629 4.3672 3.5254 6.5785 3.5750 1.8317 2.2255 1.2343 1.7598 1.1736 1.7536 1.2466 2.2230 1.7048 1.4532 2.1813 1.3793 6.1943 1.3151 1.6157 1.7777 2.0581 1.7302 2.6543 1.5646 1.6007 2.6230 2.1111 2.5301 1.0551 2.8307 1.1302 1.1704 2.2794 1.1674 1.3754 1.3974 1.4402 1.4057 1.5932 5.3893 1.2098 1.2250 1.2073 2.3724 1.0707 1.0545 1.1020 1.0432 1.0689 2.0505 1.0482 1.0835 1.0523 1.0644 5.7665 6.0914 11.9692 1.0545 1.0414 1.0400 1.0389 1.0513 1.0606 1.1014 1.1007 1.1006 1.0990 1.0988 1.0985 1.1004 1.1004 1.1003 1.0845 1.0879 1.0928 1.0968 1.1016
irintensity: 0.0010 0.4958 0.6087 0.0539 0.0097 1.0783 0.1892 0.0403 0.3976 0.0964 0.0476 0.4896 0.4662 0.0657 0.3595 1.1251 0.8153 0.0009 0.1545 3.2131 1.5599 4.1139 4.3344 1.1414 0.0301 5.1093 42.9668 13.6780 4.8989 67.2117 2.8688 16.6560 0.0001 5.1238 14.5134 7.0760 1.8684 0.0011 0.0260 0.2284 7.0002 13.3986 3.6591 6.8982 1.0176 0.0169 10.3818 4.0959 1.1766 3.8957 0.0154 3.5987 0.0374 0.2666 0.1431 2.0934 8.0331 0.2445 0.1427 11.2859 8.9566 0.0380 32.0195 1.7360 15.0490 5.5867 1.6735 4.1158 31.2279 0.3063 20.1268 25.9543 0.6767 7.7962 11.8367 2.9031 2.4206 20.8552 19.9773 18.4007 26.0152 30.5894 11.4913 97.9312 11.4425 0.2308 47.5867 13.4548 37.0622 17.0591 91.4003 6.2077 100.4779 39.7049 2.2155 3.8807 22.9312 34.6349 18.4911
temp: 298.150 k
press: 1.00000 atm
elementType: 6 6 6 6 6 6 6 6 6 6 6 6 6 6 6 1 1 1 1 1 1 1 1 1 1 1 1 1 1 1 1 1 1 1 1
symmnumber: 1
zpe: 794878.7 jmol-1
zpe.correction: 0.302753 hartree
zpe.thermalcorrener: 0.319312 hartree
zpe.thermalcorrenthalpy: 0.320256 hartree
zpe.thermalcorrgfe: 0.256293 hartree
zpe.sumelectzpe: -582.415337 hartree
zpe.sumelectthermal: -582.398779 hartree
zpe.sumelectthermalent: -582.397835 hartree
zpe.sumelectthermalfe: -582.461798 hartree
dipole: 0.5825 -0.0048 -0.0318
dipole: 0.5834
quadrupole: -81.0558 -95.6342 -86.6302
quadrupole: 0.0036 -0.2002 -2.0425
quadrupole: 6.7176 -7.8608 1.1432 0.0036 -0.2002 -2.0425
hfenergy: -582.7180903 hartree
pointgroup: C01 [X(C15H20)]
dipole: -0.2292194 -0.0065128 0.0097869 debye
polarizability: 249.7648447|0.6159922|115.5000747|-1.5350884|-4.7359838|143.4608778 unknown
InChI: InChI=1S/C15H20/c1-4-15(5-2,6-3)13-12-14-10-8-7-9-11-14/h7-11H,4-6H2,1-3H3
charge 0 multiplicity 1
35 atoms
C  -2.254226 -0.062014 0.19793
C  -2.730534 0.906273 1.340788
C  -2.815563 0.375859 -1.202605
C  -2.71968 -1.513417 0.584537
C  -2.350781 2.389438 1.156966
C  -4.3546 0.406124 -1.317077
C  -2.355129 -2.61887 -0.42667
C  -0.772613 -0.0355 0.124665
C  0.463747 -0.016923 0.05942
C  1.898676 0.004877 -0.018797
C  2.555149 0.263735 -1.258282
C  2.696098 -0.232516 1.139545
C  3.96303 0.283249 -1.333477
C  4.103718 -0.211383 1.057274
C  4.744473 0.045995 -0.177809
H  -2.301628 0.536563 2.293143
H  -3.830339 0.810146 1.43506
H  -2.408923 1.377164 -1.4388
H  -2.403024 -0.306241 -1.969827
H  -2.268977 -1.756655 1.566913
H  -3.816623 -1.493871 0.740603
H  -2.648853 2.977333 2.04451
H  -1.259687 2.503896 1.024384
H  -2.850175 2.838379 0.279163
H  -4.652635 0.717178 -2.335292
H  -4.802142 -0.586945 -1.130892
H  -4.808617 1.121296 -0.607266
H  -1.267584 -2.631605 -0.622071
H  -2.641165 -3.611607 -0.033218
H  -2.874215 -2.482712 -1.392839
H  1.94926 0.447156 -2.152074
H  2.199338 -0.431832 2.095089
H  4.452911 0.483266 -2.293145
H  4.702896 -0.395677 1.956159
H  5.838315 0.06154 -0.238908
