program: Gaussian 09
title: 000143322
version: EM64L-G09RevD.01
frameworkgroup: C1[X(C2N2S)]
method: RPBEPBE
basis: SDD
operation: Freq
keyword: #p
keyword: freq=noraman
keyword: PBEPBE/SDD
title: #p freq=noraman PBEPBE/SDD
converged: NO YES NO YES
title: Mulliken charges:
elementType: S N N C C
charge: 0.257766 0.369877 -0.024796 -0.527890 -0.074956
chargesum: 0.00000
title: Mulliken charges with hydrogens summed into heavy atoms:
polarizability: 1.81866323e+01 3.46090356e-07 1.81866934e+01 1.14789666e-03 3.28176013e-02 1.24857775e+02
1716.lowfreq: -6.8122 -6.8114 -0.0011 0.0017 0.0022 125.6414 125.6425 414.4419 414.4425
frequency: 125.6413 403.2041 414.4418 472.0774 473.3908 586.9100 1180.9280 2082.1857 2294.9449
redmass: 14.8313 12.8103 12.6516 12.5635 12.6152 18.9509 13.9711 12.6657 12.8315
irintensity: 2.0921 0.0201 0.3683 3.8399 3.3366 8.5719 25.9563 197.7725 1010.1711
temp: 298.150 k
press: 1.00000 atm
elementType: 16 7 7 6 6
symmnumber: 1
zpe: 48052.3 jmol-1
zpe.correction: 0.018302 hartree
zpe.thermalcorrener: 0.023099 hartree
zpe.thermalcorrenthalpy: 0.024044 hartree
zpe.thermalcorrgfe: -0.004284 hartree
zpe.sumelectzpe: -583.399682 hartree
zpe.sumelectthermal: -583.394885 hartree
zpe.sumelectthermalent: -583.393941 hartree
zpe.sumelectthermalfe: -583.422268 hartree
dipole: 0.0000 0.0010 -2.5347
dipole: 2.5347
quadrupole: -34.1866 -34.1866 -46.2543
quadrupole: 0.0000 -0.0001 0.0027
quadrupole: 4.0226 4.0226 -8.0451 0.0000 -0.0001 0.0027
hfenergy: -583.4179843 hartree
pointgroup: C01 [X(C2N2S1)]
dipole: -0.9972054 0.0075055 -0.0000107 debye
dipolederiv: -1.0950367 0.0073669 -0.0000123 0.0075958 0.0314176 0. -0.0000117 0. 0.0314673 -2.4768003 0.0169186 -0.000027 0.015045 0.0321772 0.0000002 -0.0000282 0.0000002 0.0322823 -0.5104017 0.0017203 -0.0000024 0.001789 -0.2485137 0. -0.0000029 0. -0.2485023 2.7587446 -0.0169551 0.0000303 -0.0163963 0.0226327 -0.0000002 0.0000303 -0.0000002 0.0225302 1.3234941 -0.0090507 0.0000114 -0.0080334 0.1622863 0. 0.0000124 0. 0.1622224 unknown
polarizability: 124.852801|-0.7291399|18.1916675|0.001147|-0.0000078|18.1866323 unknown
InChI: InChI=1S/C2N2S/c3-1-4-2-5
charge 0 multiplicity 1
5 atoms
S  -2.777368 0.018547 -0.00003
N  0.049199 0.001199 0.000001
N  2.55043 -0.018707 0.000027
C  -1.168432 0.008101 -0.000013
C  1.346172 -0.009141 0.000014
