program: Gaussian 09
title: 000142052
version: EM64L-G09RevD.01
frameworkgroup: C1[X(C10H11NS)]
method: RPBEPBE
basis: SDD
operation: Freq
keyword: #p
keyword: freq=noraman
keyword: PBEPBE/SDD
title: #p freq=noraman PBEPBE/SDD
converged: YES YES NO NO
title: Mulliken charges:
elementType: S N C C C C C C C C C C H H H H H H H H H H H
charge: 0.125712 0.306901 -0.224799 0.416327 -0.687422 -0.688049 0.240327 -0.372852 -0.360850 -0.264092 -0.213001 -0.784613 0.229996 0.209517 0.218927 0.229581 0.229569 0.219054 0.208587 0.237878 0.255296 0.231125 0.236882
chargesum: 0.00000
title: Mulliken charges with hydrogens summed into heavy atoms:
elementType: S N C C C C C C C C C C
charge: 0.125712 0.306901 0.005196 0.416327 -0.029397 -0.030840 0.240327 -0.134974 -0.105554 -0.032967 0.023881 -0.784613
polarizability: 2.20593637e+02 1.72638467e+01 1.31708572e+02 -3.82783205e-02 -5.80525036e-02 6.90797827e+01
1716.lowfreq: -0.0022 -0.0015 -0.0013 5.9415 8.2490 12.2789 25.5837 26.8171 69.1976
frequency: 25.3007 26.2799 69.1693 118.3730 183.2558 200.6034 232.5392 235.5003 267.2925 338.0072 361.3501 378.4574 413.7911 420.2408 496.1718 516.5414 556.4379 571.6420 654.2614 739.2912 751.8816 769.1677 874.5961 885.1061 911.3376 921.1751 952.5496 956.2912 987.0899 1029.5177 1068.5561 1082.1895 1113.4885 1158.9951 1175.7781 1203.1349 1257.8593 1280.2350 1311.6949 1327.5371 1379.2880 1381.7498 1398.4174 1436.2616 1466.7626 1466.8808 1473.1943 1478.4209 1489.5097 1575.4209 1604.0575 2184.6463 2976.3434 2978.9149 3014.8587 3069.6929 3078.4679 3079.7517 3084.0760 3126.2287 3140.0976 3154.7004 3170.7081
redmass: 2.7700 7.3217 5.3808 3.5903 2.9559 1.0971 3.7776 1.1603 3.0793 3.5495 7.4165 4.8329 9.4945 4.7325 3.3476 4.6989 3.5352 3.4231 6.2048 4.1549 3.3944 1.3169 1.4371 2.9610 5.9403 1.1809 1.4325 1.3919 1.3239 2.1633 1.4970 2.4587 2.6639 1.6106 1.0971 1.8108 3.5444 1.6618 1.3068 2.1377 1.1910 2.7681 1.2457 2.2862 1.0475 1.0477 1.9292 1.0486 1.2497 6.5518 6.1526 12.8730 1.0349 1.0354 1.0842 1.1001 1.0988 1.1007 1.0998 1.0867 1.0886 1.0943 1.1009
irintensity: 0.0009 0.1025 0.0537 1.0261 1.5888 0.0124 0.0078 0.4233 0.6486 0.2205 1.5624 0.1649 0.0109 2.0564 12.1156 1.4985 1.1465 2.0644 28.2122 11.5595 2.0249 85.8034 0.2547 14.8788 23.7442 2.5428 1.1844 0.8576 0.0027 16.8701 5.5147 12.9565 1.9003 0.2875 0.0469 3.7733 0.6421 4.3018 0.6857 8.6929 15.9199 1.9158 8.8229 14.4733 0.3420 6.3347 11.5243 15.5601 35.9592 3.6695 11.5247 1214.4156 29.7980 31.5292 2.8808 0.8653 74.0053 21.9564 40.2691 8.0144 6.5591 21.6502 18.9814
temp: 298.150 k
press: 1.00000 atm
elementType: 16 7 6 6 6 6 6 6 6 6 6 6 1 1 1 1 1 1 1 1 1 1 1
symmnumber: 1
zpe: 478692.5 jmol-1
zpe.correction: 0.182324 hartree
zpe.thermalcorrener: 0.194529 hartree
zpe.thermalcorrenthalpy: 0.195473 hartree
zpe.thermalcorrgfe: 0.141947 hartree
zpe.sumelectzpe: -839.613808 hartree
zpe.sumelectthermal: -839.601604 hartree
zpe.sumelectthermalent: -839.600659 hartree
zpe.sumelectthermalfe: -839.654185 hartree
dipole: -3.6963 -0.1868 0.0038
dipole: 3.7010
quadrupole: -84.3149 -70.7786 -81.8427
quadrupole: 0.3478 0.0087 -0.0168
quadrupole: -5.3362 8.2001 -2.8640 0.3478 0.0087 -0.0168
hfenergy: -839.7961325 hartree
pointgroup: C01 [X(C10H11N1S1)]
dipole: -1.4229269 -0.1140457 0.2871537 debye
dipolederiv: -1.3373487 -0.0054696 0.2521929 0.052216 -0.0750926 -0.0103962 0.2507145 0.0011094 -0.1247555 -2.3854944 -0.0064482 0.4745467 -0.0659592 -0.1455578 0.0171495 0.4759036 0.0051349 -0.1045046 0.073884 -0.1140754 0.0131559 0.0191111 0.0527506 -0.0037634 0.0096423 0.0174941 0.1198532 -0.2351207 -0.112903 0.0293391 -0.0473604 0.2787586 0.0011367 0.0287248 0.0143417 -0.1111996 0.0831232 0.0473322 -0.0341943 -0.0382672 -0.0305297 -0.0264063 -0.0309045 0.0270317 -0.016771 0.0921365 0.0366153 -0.0098789 -0.0256087 -0.0300277 0.0391929 -0.0091077 -0.0387734 -0.0248862 1.2606529 -0.0230927 -0.237233 0.0092054 0.0973508 -0.0025398 -0.238225 0.0047013 0.1184837 0.0693643 0.1755426 -0.0465856 0.0525701 -0.0510153 -0.0137262 -0.0436647 -0.0376099 -0.1286404 -0.1738373 0.0389728 0.0060398 0.0848575 -0.0126111 -0.0205059 0.004712 -0.0117616 -0.1389235 0.0090316 -0.0306791 -0.0321102 0.0656565 -0.0198854 -0.0169475 -0.0347561 0.002288 -0.1486791 -0.0774302 -0.044908 -0.0149622 -0.0932345 0.0682654 0.0119338 -0.013835 0.0024236 -0.1561669 2.8319189 0.0552667 -0.5835192 -0.0179864 -0.0636204 0.0030542 -0.5817942 -0.0115277 0.0321353 -0.1117842 0.0145707 0.0237313 0.0022628 0.0508744 -0.0016406 0.0243087 -0.0031968 0.0180785 -0.148351 -0.0340204 0.0058611 0.0162484 0.100681 -0.0198052 0.0697875 0.0039917 0.0611354 0.0528439 0.0877908 -0.0031773 0.0467333 -0.1923489 -0.0418254 -0.0219087 -0.0329234 0.0849619 0.0723803 -0.0215305 0.0286167 -0.0142838 0.0634857 0.109495 0.0130621 0.0713981 -0.1262421 0.0353078 -0.0502339 -0.0844865 -0.055466 0.0543396 -0.105837 -0.0710685 -0.0668011 -0.0804094 0.0622766 0.0985592 0.0056582 0.0640003 -0.1867778 0.0354155 0.0267714 0.010393 0.0709922 -0.1480481 -0.0351354 0.0743525 0.0180902 0.1017889 0.0115548 0.0088465 0.0076412 0.0587618 0.0139935 -0.0952104 0.0273417 -0.1180109 -0.0374717 0.0285995 0.0281518 0.0235749 0.1292174 0.0265314 -0.0884087 0.0305896 -0.0735761 -0.006114 0.0197723 0.0302916 0.0227077 0.1596321 -0.1116054 0.0453752 0.0530598 0.0304474 0.0730387 -0.0035839 0.0534845 -0.0065277 0.1493603 0.0455751 0.0620897 0.0216619 0.0883543 -0.0902812 -0.0103267 0.0208632 -0.0051095 0.1585665 unknown
polarizability: 217.6233953|-5.583542|128.7292219|-29.607583|-0.5813731|75.0293748 unknown
InChI: InChI=1S/C10H11NS/c1-8(2)9-5-3-4-6-10(9)11-7-12/h3-6,8H,1-2H3
charge 0 multiplicity 1
23 atoms
S  4.369824 0.459048 -0.924003
N  1.586309 0.533514 -0.370294
C  -0.102301 -1.839896 0.037502
C  -0.621622 -0.402024 0.099669
C  -0.768462 -2.628062 -1.122904
C  -0.301237 -2.572095 1.391872
C  0.238375 0.721652 -0.106027
C  -1.987247 -0.134423 0.364751
C  -0.263765 2.053166 -0.044365
C  -2.493906 1.180871 0.427884
C  -1.626235 2.279995 0.222154
C  2.770134 0.516824 -0.60623
H  0.984327 -1.804011 -0.165022
H  -1.861219 -2.711427 -0.97467
H  -0.355392 -3.65202 -1.176759
H  -0.594669 -2.133706 -2.095439
H  0.195075 -2.03096 2.217224
H  0.124103 -3.591207 1.341401
H  -1.373831 -2.666521 1.643893
H  -2.667422 -0.978823 0.526044
H  0.425056 2.888212 -0.206774
H  -3.555796 1.349985 0.635717
H  -2.007697 3.305408 0.268879
