program: Gaussian 09
title: 000142105
version: EM64L-G09RevD.01
frameworkgroup: C1[X(C15H15BrO2)]
method: RPBEPBE
basis: SDD
operation: Freq
keyword: #p
keyword: freq=noraman
keyword: PBEPBE/SDD
title: #p freq=noraman PBEPBE/SDD
converged: NO YES NO NO
title: Mulliken charges:
elementType: Br O O C C C C C C C C C C C C C C C H H H H H H H H H H H H H H H
charge: 0.001121 -0.283952 -0.262913 0.574005 0.624436 -0.381357 -0.647726 0.369780 -0.519887 0.360089 -0.600134 -0.828373 -0.391011 -0.376680 -0.222755 -0.229943 -0.240194 -0.535618 0.224227 0.224230 0.272107 0.262519 0.252283 0.228989 0.252304 0.280604 0.222057 0.229165 0.225738 0.228497 0.219725 0.248833 0.219835
chargesum: 0.00000
title: Mulliken charges with hydrogens summed into heavy atoms:
elementType: Br O O C C C C C C C C C C C C C C C
charge: 0.001121 -0.283952 -0.262913 0.574005 0.624436 0.067100 -0.647726 0.369780 -0.247781 0.360089 -0.337615 -0.094796 -0.110407 -0.154622 0.006410 -0.004205 -0.011697 0.152775
polarizability: 2.46159116e+02 1.23251301e+01 2.28745687e+02 -5.14344961e-02 -1.77277419e-02 8.35148704e+01
1716.lowfreq: -0.0005 -0.0001 0.0004 2.5859 4.2209 4.2940 17.6872 32.8766 48.2643
frequency: 17.1035 32.7988 48.2643 60.4990 92.4975 104.5664 138.5298 154.7971 157.2404 183.7394 212.0785 214.7305 224.0191 253.8028 254.6774 290.0647 320.4085 352.6336 401.9030 439.9636 467.8007 519.9786 537.4494 541.2903 546.5263 613.4005 618.3821 620.6113 654.0439 702.7921 711.7146 741.4413 813.3021 815.0911 857.0413 866.4108 911.3486 914.4725 923.5886 981.2838 989.1757 991.0378 999.4776 1005.9217 1023.5858 1028.1366 1047.0260 1049.0879 1071.5221 1086.3821 1111.2748 1151.5575 1164.8877 1172.6960 1187.3544 1211.9749 1213.6384 1237.7340 1307.3146 1318.2260 1354.5108 1380.0101 1393.2399 1402.4316 1420.9444 1428.0553 1439.6016 1443.4360 1463.5857 1466.0173 1468.7697 1472.0198 1484.8200 1487.8862 1583.7331 1596.1953 1610.0430 1620.3377 2936.4178 2955.4644 2983.5089 2989.7171 3043.0271 3061.9487 3095.3436 3107.6500 3125.5594 3127.8844 3141.2955 3159.2067 3165.0855 3175.3614 3180.1954
redmass: 3.9556 4.6459 6.8893 4.2444 3.4552 3.9343 5.1610 7.0410 1.0595 2.3465 2.8558 4.5691 1.6066 4.4505 2.7755 6.0459 5.2833 4.0378 2.8417 4.8182 2.7730 5.7428 5.2056 3.1917 5.4829 5.5394 5.7915 4.2214 6.8485 2.3280 2.2447 1.3851 1.8381 4.1722 1.2516 1.5672 7.3719 1.3077 6.4415 1.3689 6.2607 2.4302 1.3445 3.4846 1.6722 2.1820 4.5404 1.5390 2.7802 1.7575 1.2581 1.3749 1.8916 1.0523 1.1137 2.2524 1.0608 1.5597 1.9857 2.3198 1.9606 7.9182 3.7012 1.3086 2.8984 1.8785 1.9023 1.5955 1.0447 1.0505 1.1086 1.0602 1.4319 2.0007 5.7320 6.1724 7.7674 6.0111 1.0545 1.0333 1.0372 1.1055 1.1040 1.0972 1.0995 1.0880 1.0988 1.0867 1.0930 1.0983 1.0922 1.0970 1.0900
irintensity: 0.2064 0.0172 0.1344 0.8969 6.9315 3.2633 0.4184 0.4766 0.1478 4.5152 3.3269 4.5567 0.2226 0.2601 0.2102 2.6128 4.6528 0.6972 0.0126 1.5191 12.9303 1.6445 8.5914 0.0165 0.0984 7.3767 4.2845 4.5841 18.5610 31.1544 0.0193 79.3462 25.4484 0.7774 0.1787 40.5987 18.4546 2.4972 5.9698 0.0298 0.6776 26.8332 0.0504 71.1769 1.9729 19.1953 43.6573 11.0770 98.9659 33.7657 0.1457 23.4458 170.2242 0.1906 3.5991 2.6541 0.5822 49.2293 123.2716 110.1284 26.9529 1.2601 11.9647 21.2817 31.2909 59.8483 18.6480 8.7560 14.2937 13.3540 74.0897 30.5591 21.9006 41.5415 198.0795 1.6899 87.9879 7.3381 24.1223 60.9163 21.5363 27.4910 49.0374 13.2049 21.4113 11.6509 25.7159 1.5842 29.1627 28.9106 3.5778 8.9341 5.2319
temp: 298.150 k
press: 1.00000 atm
elementType: 35 8 8 6 6 6 6 6 6 6 6 6 6 6 6 6 6 6 1 1 1 1 1 1 1 1 1 1 1 1 1 1 1
symmnumber: 1
zpe: 678543.4 jmol-1
zpe.correction: 0.258444 hartree
zpe.thermalcorrener: 0.276040 hartree
zpe.thermalcorrenthalpy: 0.276984 hartree
zpe.thermalcorrgfe: 0.210359 hartree
zpe.sumelectzpe: -743.174245 hartree
zpe.sumelectthermal: -743.156648 hartree
zpe.sumelectthermalent: -743.155704 hartree
zpe.sumelectthermalfe: -743.222329 hartree
dipole: -0.5499 3.6919 0.0009
dipole: 3.7326
quadrupole: -107.4297 -96.3293 -121.3692
quadrupole: -2.8160 0.0007 0.0230
quadrupole: 0.9463 12.0468 -12.9931 -2.8160 0.0007 0.0230
hfenergy: -743.4326881 hartree
pointgroup: C01 [X(C15H15Br1O2)]
dipole: 0.0343837 1.4644375 -0.1041296 debye
polarizability: 248.9265961|-9.7652841|225.2656174|0.8480035|-10.0494662|84.22746 unknown
InChI: InChI=1S/C15H15BrO2/c1-11-8-13(17-2)9-14(15(11)16)18-10-12-6-4-3-5-7-12/h3-9H,10H2,1-2H3
charge 0 multiplicity 1
33 atoms
Br -0.571365 -3.22747 0.329825
O  0.433249 -0.394773 0.130346
O  -3.954832 1.914526 -0.036273
C  -0.962004 -0.348764 0.126406
C  -3.056066 -1.659435 0.221291
C  1.173116 0.86959 0.04252
C  -1.639607 -1.590746 0.215275
C  2.662177 0.566503 0.067343
C  -1.705368 0.856211 0.039707
C  -3.118562 0.791562 0.044474
C  -3.784076 -0.451289 0.134628
C  -3.793359 -2.979779 0.317227
C  3.157324 -0.754909 0.160373
C  3.575233 1.649197 -0.005671
C  4.552317 -0.988122 0.179767
C  4.967005 1.414215 0.013827
C  5.460979 0.091499 0.106878
C  -3.323557 3.231903 -0.132636
H  0.894856 1.520467 0.898642
H  0.899146 1.392902 -0.898262
H  -1.188077 1.815101 -0.029441
H  -4.877672 -0.462023 0.136136
H  -3.52859 -3.52001 1.244974
H  -4.884276 -2.820543 0.306579
H  -3.529799 -3.647878 -0.523457
H  2.448482 -1.58553 0.216391
H  3.201101 2.679212 -0.077906
H  4.926901 -2.015423 0.251952
H  5.663331 2.258482 -0.043237
H  6.540989 -0.093077 0.122083
H  -2.703072 3.448165 0.759378
H  -4.158437 3.945889 -0.183229
H  -2.705584 3.317247 -1.048208
