program: Gaussian 09
title: 000140225
version: EM64L-G09RevD.01
frameworkgroup: C1[X(C16H26O)]
method: RPBEPBE
basis: SDD
operation: Freq
keyword: #pfreq=noraman
keyword: PBEPBE/SDD
title: #p freq=noraman PBEPBE/SDD
converged: YES YES NO NO
title: Mulliken charges:
elementType: O C C C C C C C C C C C C C C C C H H H H H H H H H H H H H H H H H H H H H H H H H H
charge: -0.436943 -0.194584 -0.429708 -0.380959 -0.375921 -0.395666 -0.376117 0.530644 -0.354351 -0.705093 -0.356649 -0.433332 -0.380850 -0.696995 -0.386541 -0.367898 0.274772 0.192876 0.196975 0.191772 0.218006 0.183717 0.192712 0.188414 0.196592 0.198054 0.188219 0.192684 0.186874 0.188488 0.212511 0.204651 0.234712 0.194252 0.195379 0.231684 0.229724 0.209300 0.214617 0.209966 0.215903 0.246690 0.351420
chargesum: 0.00000
title: Mulliken charges with hydrogens summed into heavy atoms:
elementType: O C C C C C C C C C C C C C C C C
charge: -0.085523 -0.001708 -0.040962 0.020763 0.005205 -0.001020 0.004787 0.530644 0.021011 -0.053220 0.032983 -0.201648 -0.151126 -0.063113 -0.170638 -0.121208 0.274772
polarizability: 1.81739155e+02 1.71771885e+01 1.87599505e+02 1.22824097e+00 3.25561541e+00 1.56065477e+02
1716.lowfreq: -13.1720 -5.5388 -4.4519 -0.0004 0.0004 0.0006 16.8030 20.7362 39.7839
frequency: 15.9738 20.6691 39.6238 44.9532 55.7949 66.2324 91.4298 108.3039 122.2297 132.9939 140.4252 169.0561 190.2454 217.0474 228.3331 230.3618 242.0087 328.2974 340.0507 347.3500 386.3520 399.8657 410.4977 417.6236 475.9213 493.7893 528.3378 559.3219 635.0896 679.3546 719.0996 724.3175 732.1596 756.4912 788.6780 805.7963 811.4649 831.3525 836.2229 886.0171 896.8029 911.3055 931.3013 955.1718 976.3796 987.9669 1002.6460 1016.9525 1017.6920 1036.2645 1055.8407 1071.1718 1077.9762 1080.4960 1091.7180 1100.8700 1118.6892 1134.1955 1143.0277 1178.0411 1188.0736 1198.2896 1218.7106 1228.7240 1240.8919 1246.4092 1257.4154 1266.4604 1278.5113 1283.3421 1289.4431 1291.9129 1302.6795 1315.0155 1328.3033 1341.7430 1351.7086 1354.5350 1357.1943 1387.1449 1389.2422 1391.4091 1426.0022 1455.7096 1460.9527 1462.6420 1466.6100 1469.5542 1475.3068 1476.3794 1477.0629 1483.3503 1484.2523 1488.4941 1502.4187 1596.1096 1624.7150 2947.8021 2949.2299 2951.4195 2952.9937 2955.6139 2961.1364 2966.9137 2968.4421 2970.8897 2974.9026 2982.9021 2991.7862 3000.3910 3011.2964 3018.2351 3029.1658 3040.7342 3067.0524 3067.3242 3069.2340 3079.4405 3107.7143 3121.7035 3133.8656 3165.2419 3582.5964
redmass: 3.6791 4.2779 1.6514 3.0075 3.4697 2.6640 1.7044 2.5291 3.1641 2.5226 1.8722 2.4154 3.0925 3.3663 2.8063 1.1196 1.4412 3.4432 3.2041 1.1531 3.6421 3.6909 3.0118 3.6938 2.9387 3.2866 2.8242 2.3670 6.8777 2.7456 1.0940 1.4551 1.6592 1.2338 1.3589 1.5870 2.2940 1.5702 1.4176 1.9537 1.6257 1.4004 1.4121 1.3711 3.1526 1.4542 2.8160 2.0853 3.3644 1.6169 2.6781 1.8717 2.0424 2.0190 1.9433 1.9304 1.9397 2.0496 1.4538 1.1074 1.7293 1.8736 1.4041 1.4025 1.3845 2.4792 1.2751 1.2516 1.0435 1.2255 1.1543 1.1039 1.3154 1.3328 1.4730 1.4469 1.5303 1.7030 1.5697 1.2532 1.2184 4.3945 2.6187 1.0784 1.0724 1.0719 1.0751 1.0812 1.0427 1.0781 1.0430 1.0821 1.0649 1.0909 2.7155 6.3544 6.4811 1.0593 1.0590 1.0763 1.0614 1.0619 1.0608 1.0589 1.0608 1.0366 1.0373 1.0960 1.0974 1.0998 1.1033 1.1014 1.1042 1.1041 1.0994 1.1006 1.0993 1.0998 1.0873 1.0892 1.0960 1.0951 1.0660
irintensity: 0.9519 0.2967 0.0189 0.0938 0.0356 0.0599 0.0213 0.1056 0.0280 0.1482 0.0006 0.1972 0.4213 0.0385 0.0567 0.0003 0.0557 0.3617 5.4444 140.9112 7.2465 1.2689 2.2751 3.8112 2.5628 7.4080 5.6342 23.0969 0.3479 22.2873 9.5783 2.8996 0.9086 1.4034 3.9215 22.0015 12.2484 45.8332 4.5729 2.3841 4.6086 6.1678 0.4302 0.3460 0.5348 0.0913 2.8547 0.3461 0.0778 1.0672 0.6372 6.0329 1.5550 9.7080 14.0451 8.8333 18.0302 80.5626 158.3994 4.6328 0.3730 2.5057 6.2799 0.9324 1.5288 27.8206 0.3938 0.2327 0.5797 0.4311 0.2252 0.8874 12.3296 4.3814 3.2786 3.3462 2.2344 0.5531 1.7805 15.1902 11.4738 12.9904 11.6818 0.1379 0.1084 0.1208 1.8481 3.2034 9.6382 1.3570 11.9428 2.6685 7.9943 24.2936 90.4702 11.4048 29.5474 0.3136 0.0403 11.4228 2.8778 3.0987 25.4372 55.7508 176.1795 39.3869 31.0730 2.7020 2.7941 3.0939 0.1552 30.8012 0.3839 188.4808 46.4559 97.8269 56.6123 56.3594 20.2488 17.2168 16.5566 6.7182 35.9887
temp: 298.150 k
press: 1.00000 atm
elementType: 8 6 6 6 6 6 6 6 6 6 6 6 6 6 6 6 6 1 1 1 1 1 1 1 1 1 1 1 1 1 1 1 1 1 1 1 1 1 1 1 1 1 1
symmnumber: 1
zpe: 997197.4 jmol-1
zpe.correction: 0.379812 hartree
zpe.thermalcorrener: 0.399821 hartree
zpe.thermalcorrenthalpy: 0.400766 hartree
zpe.thermalcorrgfe: 0.328131 hartree
zpe.sumelectzpe: -699.185860 hartree
zpe.sumelectthermal: -699.165851 hartree
zpe.sumelectthermalent: -699.164907 hartree
zpe.sumelectthermalfe: -699.237542 hartree
dipole: -0.1986 -0.3082 1.5774
dipole: 1.6194
quadrupole: -111.7976 -103.1567 -101.3840
quadrupole: 2.5885 5.9369 6.5538
quadrupole: -6.3515 2.2894 4.0621 2.5885 5.9369 6.5538
hfenergy: -699.5656727 hartree
pointgroup: C01 [X(C16H26O1)]
dipole: 0.0795226 0.1107059 0.6223762 debye
polarizability: 182.3520506|17.2906889|187.0776913|-0.9986323|-2.7549438|155.9743955 unknown
InChI: InChI=1S/C16H26O/c1-3-5-6-7-8-9-14(4-2)15-10-12-16(17)13-11-15/h10-14,17H,3-9H2,1-2H3
charge 0 multiplicity 1
43 atoms
O  -3.778872 -3.439276 -0.356714
C  -1.253584 1.733096 0.275526
C  0.169465 1.754785 -0.358353
C  1.179174 0.808638 0.327437
C  2.579759 0.841126 -0.324698
C  -2.132461 2.875529 -0.315972
C  3.599956 -0.08225 0.378651
C  -1.921438 0.363107 0.132304
C  4.998382 -0.067189 -0.278744
C  -3.504721 3.0283 0.373298
C  6.01916 -0.983855 0.433646
C  -2.25894 -0.413825 1.266825
C  -2.225828 -0.174926 -1.148493
C  7.412782 -0.967338 -0.230991
C  -2.875874 -1.68026 1.142642
C  -2.840145 -1.433483 -1.29514
C  -3.165944 -2.188458 -0.144543
H  -1.135339 1.93793 1.361554
H  0.094188 1.493909 -1.434639
H  0.55794 2.793825 -0.316672
H  0.788507 -0.228282 0.304763
H  1.268567 1.085472 1.399498
H  2.492538 0.54526 -1.391313
H  2.96522 1.882706 -0.322064
H  -2.280621 2.696329 -1.400516
H  -1.568927 3.826996 -0.233103
H  3.692846 0.21904 1.4434
H  3.209069 -1.12139 0.3838
H  5.388032 0.972599 -0.291471
H  4.908269 -0.37724 -1.341082
H  -4.083275 3.859186 -0.070762
H  -3.384676 3.23951 1.45318
H  -4.103872 2.105304 0.276314
H  6.109939 -0.671587 1.494297
H  5.627218 -2.021534 0.448521
H  -2.037635 -0.025158 2.268304
H  -1.979748 0.398308 -2.050655
H  7.838873 0.053938 -0.232131
H  8.123362 -1.629394 0.297582
H  7.353789 -1.305783 -1.282835
H  -3.126247 -2.261485 2.040259
H  -3.074298 -1.845748 -2.281374
H  -3.96909 -3.88583 0.505264
