program: Gaussian 09
title: 000140185
version: EM64L-G09RevD.01
frameworkgroup: C1[X(C7H12O)]
method: RPBEPBE
basis: SDD
operation: Freq
keyword: #pfreq=noraman
keyword: PBEPBE/SDD
title: #p freq=noraman PBEPBE/SDD
converged: YES YES NO NO
title: Mulliken charges:
elementType: O C C C C C C C H H H H H H H H H H H H
charge: -0.454941 -0.235203 -0.500762 0.540262 -0.812380 -0.021150 -0.748684 -0.599531 0.215052 0.224512 0.219455 0.222966 0.233937 0.244343 0.250233 0.342411 0.224840 0.225460 0.215116 0.214064
chargesum: 0.00000
title: Mulliken charges with hydrogens summed into heavy atoms:
elementType: O C C C C C C C
charge: -0.112530 -0.020151 -0.056795 0.540262 -0.111133 0.229084 -0.298384 -0.170352
polarizability: 1.01187650e+02 3.72343911e-01 7.23598339e+01 2.48743109e+00 5.09362584e+00 6.58328957e+01
1716.lowfreq: -0.0009 -0.0008 -0.0008 4.6320 9.0689 13.1647 63.9998 80.2341 100.6432
frequency: 63.9867 80.2037 100.6392 166.1064 192.1174 240.3211 271.6046 339.8470 352.8783 386.3151 465.1093 527.0723 556.5394 641.9743 721.7067 803.5032 858.4571 928.4290 939.4870 954.2308 959.3484 977.4204 1017.3284 1022.0417 1030.9074 1053.7293 1120.1770 1194.7380 1260.3273 1267.4296 1281.4676 1303.3301 1322.8579 1357.4052 1390.3227 1424.4036 1433.2395 1442.6975 1463.0407 1481.6034 1656.8139 1662.6728 2966.6484 2974.3836 2984.0933 3051.9245 3054.0953 3082.5315 3084.2780 3091.5431 3114.5196 3187.6581 3191.4667 3558.3994
redmass: 3.1630 2.5379 2.9769 2.3536 1.0571 3.5954 2.7956 2.3656 1.2440 2.2147 2.0296 2.2545 2.6932 1.6044 1.1618 2.9473 2.5259 1.7774 1.3458 1.3265 1.6052 2.1881 1.5610 1.4084 1.6791 1.5680 1.5830 1.4238 1.4191 1.2620 1.2958 2.1272 1.2308 1.4825 1.2402 1.1628 1.1937 1.1243 1.0499 1.0595 4.7157 4.9431 1.0821 1.0393 1.0616 1.0989 1.0958 1.0604 1.0627 1.0998 1.0938 1.1136 1.1139 1.0662
irintensity: 0.7221 0.4505 0.4854 0.2109 0.3035 2.8269 5.6967 23.4701 112.8474 14.3545 8.2709 16.1053 7.3741 19.7339 1.5312 12.6836 10.5846 11.1547 77.0081 71.0460 22.9167 30.0886 13.5600 35.1716 33.5029 3.7875 5.6815 22.4573 6.3260 16.1095 3.8487 2.1775 2.7284 16.9212 28.8294 3.3024 1.8629 20.2269 9.1977 25.8335 15.9986 18.5622 32.2865 9.0626 41.6541 28.0388 11.8597 12.0787 9.2222 23.0752 8.5693 24.6326 31.6180 4.7809
temp: 298.150 k
press: 1.00000 atm
elementType: 8 6 6 6 6 6 6 6 1 1 1 1 1 1 1 1 1 1 1 1
symmnumber: 1
zpe: 448930.8 jmol-1
zpe.correction: 0.170989 hartree
zpe.thermalcorrener: 0.180863 hartree
zpe.thermalcorrenthalpy: 0.181807 hartree
zpe.thermalcorrgfe: 0.136098 hartree
zpe.sumelectzpe: -348.472087 hartree
zpe.sumelectthermal: -348.462213 hartree
zpe.sumelectthermalent: -348.461268 hartree
zpe.sumelectthermalfe: -348.506977 hartree
dipole: -1.4596 -0.6404 -0.4281
dipole: 1.6504
quadrupole: -48.8740 -51.0041 -48.2566
quadrupole: -1.5665 -0.1998 -1.4874
quadrupole: 0.5042 -1.6259 1.1217 -1.5665 -0.1998 -1.4874
hfenergy: -348.6430753 hartree
pointgroup: C01 [X(C7H12O1)]
dipole: 0.5803102 0.2474508 -0.1536696 debye
dipolederiv: -0.5010824 -0.0385538 -0.1869704 -0.0441727 -0.8094382 -0.1095775 -0.2381934 -0.1224838 -0.377698 0.4354113 0.007367 -0.0363572 -0.0651375 0.6703334 0.0845854 -0.0179657 0.1654662 0.2832665 -0.1678381 0.0096725 0.0303666 -0.0285352 0.0562303 -0.0336708 -0.0541979 -0.0925617 0.0842761 0.0726428 0.0314423 0.0454337 0.1814589 -0.0682746 -0.1694657 0.0707396 -0.2079549 0.2450497 -0.0371618 -0.0235608 -0.0451547 -0.0153979 0.0199282 0.0626451 -0.0691813 0.0969704 -0.1511972 0.2668534 -0.0713822 0.1142465 0.0486955 0.0941472 0.0859555 0.2735599 0.0633131 -0.1646793 -0.1392208 0.0667779 0.1748389 0.0521153 -0.3451047 -0.0808187 0.1353982 -0.0861655 -0.1848247 -0.2180358 0.0674164 0.1260644 0.0851552 0.0069635 0.1533728 0.0949939 0.1522954 -0.3406619 0.0144089 0.0022163 -0.0223982 0.0394049 -0.0754534 0.0699021 -0.0454237 0.0894017 -0.1535579 0.0156376 0.0468288 -0.0579068 0.000754 0.0436281 0.1087586 -0.067428 0.0789494 -0.0581339 0.0444208 0.0038122 0.000486 -0.0461465 -0.1221442 -0.0706096 -0.0034856 -0.0393458 0.070621 -0.1656667 -0.019959 -0.0766071 -0.0676348 0.0946952 0.0004021 -0.0062061 0.0133987 0.0759979 0.0577961 0.0739254 0.0922919 0.0589604 0.0518164 -0.0711864 0.097254 -0.0313103 -0.0690523 0.1342724 -0.0423921 -0.0057077 -0.0214426 -0.099421 0.0533163 0.0154049 0.0057051 0.0866449 0.0811632 -0.0045805 -0.0370877 -0.0602316 -0.0583892 -0.0738581 -0.0750885 -0.0643407 0.1214384 0.1582183 0.0609432 0.193496 0.0183573 0.2973228 0.006841 0.2069265 0.0000983 0.1950001 0.0635402 0.0024986 -0.1109043 -0.006263 0.1255689 0.0867642 -0.0755221 0.0992432 -0.052326 -0.0898083 -0.0943439 -0.0640792 -0.0955586 0.1437222 0.0372042 -0.0937176 0.0239167 0.0901775 -0.1080528 -0.0332162 -0.087451 -0.0332898 0.070823 -0.0528491 -0.1176096 -0.0470657 0.1569404 0.0825016 -0.0449122 -0.0466 -0.0010914 -0.0969539 -0.0877113 -0.0302576 -0.0975297 0.1427188 unknown
polarizability: 101.2800671|0.1721652|72.4846583|-1.8329841|-4.9763189|65.6156543 unknown
InChI: InChI=1S/C7H12O/c1-4-5-7(8)6(2)3/h4,7-8H,1-2,5H2,3H3
charge 0 multiplicity 1
20 atoms
O  0.154584 -1.643392 -0.614078
C  0.219853 -0.165013 -0.455131
C  -0.890102 0.176907 0.565565
C  1.617302 0.265706 -0.015497
C  2.115584 -0.262758 1.316432
C  -2.270513 -0.162244 0.04464
C  2.36358 1.070423 -0.819128
C  -3.314191 0.703075 -0.00879
H  -0.016994 0.32207 -1.425076
H  -0.688568 -0.406859 1.486184
H  -0.82657 1.250171 0.824708
H  3.193681 -0.070995 1.450116
H  1.579453 0.214461 2.159788
H  1.932565 -1.350318 1.394631
H  -2.392824 -1.19541 -0.309432
H  0.83936 -1.91293 -1.277861
H  1.978341 1.442093 -1.777266
H  3.37527 1.387736 -0.540532
H  -4.294089 0.397712 -0.393303
H  -3.220823 1.742166 0.33323
