program: Gaussian 09
title: 000139527
version: EM64L-G09RevD.01
frameworkgroup: C1[X(C6H10)]
method: RPBEPBE
basis: SDD
operation: Freq
keyword: #p
keyword: freq=noraman
keyword: PBEPBE/SDD
title: #p freq=noraman PBEPBE/SDD
converged: YES YES NO NO
title: Mulliken charges:
elementType: C C C C C C H H H H H H H H H H
charge: -0.121813 -0.685045 -0.684413 -0.231564 0.133097 -0.614373 0.221533 0.205070 0.229089 0.214068 0.205164 0.213930 0.229108 0.228986 0.228591 0.228572
chargesum: 0.00000
title: Mulliken charges with hydrogens summed into heavy atoms:
elementType: C C C C C C
charge: 0.099720 -0.036818 -0.036211 -0.002578 0.133097 -0.157210
polarizability: 1.00857032e+02 -1.08201594e-01 5.19681952e+01 9.31411907e+00 -4.26286982e-02 5.01454534e+01
1716.lowfreq: -29.8184 -15.8971 -10.9681 -0.0006 -0.0003 0.0004 49.1142 150.9810 198.8388
frequency: 48.3527 150.9743 198.8337 234.7915 293.6102 316.3917 323.7398 404.7112 530.5466 608.2716 822.1254 870.8398 885.9693 913.3603 917.4650 951.2323 999.9722 1082.2741 1112.4895 1145.4832 1173.1928 1261.5792 1307.4148 1350.7162 1373.6811 1392.2420 1441.9167 1463.8807 1466.6176 1476.8278 1484.9995 2000.1158 2970.8579 2973.6468 3006.4121 3060.8181 3062.6544 3072.5752 3073.6239 3079.5629 3084.0398 3165.5781
redmass: 2.7077 2.7223 1.0243 1.1402 1.8124 2.1498 2.2842 2.4324 4.4706 1.7136 2.2351 1.3061 1.1723 2.2571 1.1822 1.4389 1.4820 1.6873 2.5185 2.0758 1.7204 1.4301 1.3337 1.4469 1.2002 1.2036 1.3931 1.0453 1.0507 1.0498 1.0608 9.9705 1.0352 1.0356 1.0851 1.0892 1.0997 1.0972 1.0605 1.1003 1.0994 1.1129
irintensity: 0.0444 0.9212 0.0470 0.2166 0.3531 10.5020 0.1063 2.2186 7.6082 2.5393 5.6652 94.6701 21.6399 8.2171 5.4177 0.4506 0.3745 12.2801 6.8223 1.4635 15.7890 3.3123 0.8199 5.1456 16.6236 7.7251 5.1498 3.9307 2.7250 13.7490 16.2444 51.9954 30.9717 39.4752 5.6073 0.7880 0.9217 104.8391 6.7878 27.8169 46.5898 8.9816
temp: 298.150 k
press: 1.00000 atm
elementType: 6 6 6 6 6 6 1 1 1 1 1 1 1 1 1 1
symmnumber: 1
zpe: 362195.7 jmol-1
zpe.correction: 0.137953 hartree
zpe.thermalcorrener: 0.145759 hartree
zpe.thermalcorrenthalpy: 0.146703 hartree
zpe.thermalcorrgfe: 0.106202 hartree
zpe.sumelectzpe: -234.099523 hartree
zpe.sumelectthermal: -234.091717 hartree
zpe.sumelectthermalent: -234.090773 hartree
zpe.sumelectthermalfe: -234.131275 hartree
dipole: 0.5540 0.0043 -0.1570
dipole: 0.5759
quadrupole: -36.1511 -38.5555 -38.1606
quadrupole: -0.0204 1.2827 -0.0011
quadrupole: 1.4713 -0.9331 -0.5382 -0.0204 1.2827 -0.0011
hfenergy: -234.2374764 hartree
pointgroup: C01 [X(C6H10)]
dipole: 0.2186694 -0.0082071 0.0587486 debye
dipolederiv: 0.208681 -0.0005277 0.0022546 -0.0129981 0.1673934 0.0053955 0.1851348 0.0039788 0.1053506 -0.057703 -0.04803 -0.0016063 0.0167267 -0.0462463 0.0053148 -0.0930294 -0.0107635 0.1025812 -0.0573003 0.0468794 0.005425 -0.0027626 -0.0458582 -0.0281112 -0.0958795 -0.0097333 0.1001925 -0.1709301 -0.0085273 0.0794331 -0.0150412 -0.2796362 -0.0376404 0.122461 -0.0391407 0.1571774 0.5238086 0.0131286 -0.2256963 0.0223359 -0.151995 -0.0047803 -0.3242242 -0.00354 -0.0701945 -0.4237649 0.0106957 -0.0619553 0.004222 0.1583522 0.0490119 0.0090922 0.0484247 -0.4060623 0.0197171 -0.0060565 0.0816107 -0.0032613 0.0306111 0.0121927 0.0410497 0.0122971 -0.1407215 0.0734698 -0.0292575 0.0492651 -0.0049201 0.070192 -0.015987 0.0991198 0.0481933 -0.1560351 0.0457736 0.1179882 0.0401332 0.0786998 -0.117181 -0.0484345 0.0374369 -0.0532104 0.0790172 -0.1592439 -0.0300993 -0.1166328 -0.0246276 0.0754634 0.029606 -0.1361867 0.0060196 0.004179 0.0742028 0.0214196 0.0546125 -0.0107296 0.0695094 0.049183 0.0980983 -0.0164984 -0.1553689 -0.1565214 0.054683 -0.1108738 0.0539394 0.076167 -0.014456 -0.1307173 0.0098758 0.0005844 0.0386355 -0.1280128 0.0221738 -0.0888545 -0.1206256 0.0156928 0.0256528 0.0207388 0.0896373 0.0175709 -0.0044048 0.0706711 0.00046 0.1690401 0.020903 0.0149809 0.0216782 -0.0834851 0.0130832 0.058935 0.0608327 0.0791734 -0.0249755 -0.0467206 0.0807408 -0.0367715 0.1826029 0.0105211 -0.0688137 0.0503527 -0.0923622 -0.0302108 0.0088302 0.0662699 -0.0015486 0.1905449 unknown
polarizability: 100.6267145|0.3718299|51.9541075|-9.9120156|0.1702713|50.3898588 unknown
InChI: InChI=1S/C6H10/c1-4-5-6(2)3/h5-6H,1H2,2-3H3
charge 0 multiplicity 1
16 atoms
C  0.96487 -0.024717 0.310405
C  1.828586 1.254106 0.15542
C  1.786037 -1.292834 -0.039922
C  -0.277315 0.064507 -0.577999
C  -1.535872 0.039234 -0.145585
C  -2.79059 0.012111 0.299357
H  0.631331 -0.099952 1.363017
H  2.1680 1.37305 -0.891463
H  1.257064 2.157633 0.432643
H  2.727264 1.198737 0.797966
H  2.125232 -1.261352 -1.093099
H  2.683142 -1.36647 0.603003
H  1.18337 -2.208238 0.096506
H  -0.084396 0.154621 -1.65993
H  -3.325346 0.931973 0.568778
H  -3.341178 -0.93101 0.409404
