program: Gaussian 09
title: 000139338
version: EM64L-G09RevD.01
frameworkgroup: C1[X(C5H4)]
method: RPBEPBE
basis: SDD
operation: Freq
keyword: #p
keyword: freq=noraman
keyword: PBEPBE/SDD
title: #p freq=noraman PBEPBE/SDD
converged: YES YES YES YES
title: Mulliken charges:
elementType: C C C C C H H H H
charge: -0.599818 -0.599818 0.132170 0.132169 -0.032448 0.241920 0.241952 0.241964 0.241909
chargesum: 0.00000
title: Mulliken charges with hydrogens summed into heavy atoms:
elementType: C C C C C
charge: -0.115946 -0.115945 0.132170 0.132169 -0.032448
polarizability: 1.53794284e+02 -2.34481385e-03 2.50101457e+01 2.62863762e-03 -2.49516734e-06 2.50031778e+01
1716.lowfreq: -1.6643 -0.0008 -0.0007 -0.0005 0.5574 30.9742 146.9140 146.9772 313.2377
frequency: 146.9135 146.9769 313.2377 313.2529 512.7319 512.7458 677.4947 724.3948 852.9242 852.9295 983.9928 983.9966 1296.4192 1408.3178 1464.9360 1904.2063 2193.0404 3074.2221 3075.3435 3169.8203 3169.8257
redmass: 3.4560 3.4563 3.7319 3.7323 8.4110 8.4107 1.0078 4.6357 1.3260 1.3260 1.4625 1.4625 1.8247 1.1217 1.9471 9.9327 11.5929 1.0571 1.0602 1.1131 1.1131
irintensity: 6.6315 6.6292 0.2991 0.2974 0.4874 0.4875 0.0000 0.0000 100.8666 100.9853 4.2061 4.2172 4.4737 0.0000 38.4212 0.0000 157.3634 1.2213 0.0000 2.9980 2.9976
temp: 298.150 k
press: 1.00000 atm
elementType: 6 6 6 6 6 1 1 1 1
symmnumber: 1
zpe: 166147.7 jmol-1
zpe.correction: 0.063282 hartree
zpe.thermalcorrener: 0.069107 hartree
zpe.thermalcorrenthalpy: 0.070052 hartree
zpe.thermalcorrgfe: 0.035466 hartree
zpe.sumelectzpe: -192.464069 hartree
zpe.sumelectthermal: -192.458243 hartree
zpe.sumelectthermalent: -192.457299 hartree
zpe.sumelectthermalfe: -192.491885 hartree
dipole: 0.0000 0.0010 0.0008
dipole: 0.0013
quadrupole: -19.4763 -30.2847 -30.2899
quadrupole: 0.0009 -0.0003 0.0000
quadrupole: 7.2074 -3.6011 -3.6063 0.0009 -0.0003 0.0000
hfenergy: -192.5273509 hartree
pointgroup: C01[X(C5H4)]
dipole: -0.0000006 0.0003657 -0.0003489 debye
dipolederiv: -0.5305604 -0.0003684 0.0005109 -0.0005459 -0.232642 -0.2489524 0.0009376 -0.2489192 -0.1115652 -0.5305618 0.0000557 0.0002904 0.0007252 -0.1111619 0.2488513 0.0005686 0.248823 -0.2330471 0.8257711 0.000288 -0.0009266 0.0008017 0.0020445 0.0469111 -0.0013841 0.0469154 -0.0207573 0.8257739 0.0001495 -0.0005567 -0.0004882 -0.0208493 -0.0468892 -0.0010566 -0.0468935 0.0021332 -0.6259311 -0.0001014 0.0005204 -0.000419 -0.0733595 -0.0000067 0.0008127 -0.0000068 -0.0734149 0.0087162 0.0441994 -0.0561054 0.0356214 0.1341207 0.1027923 -0.0452411 0.1027795 0.0841887 0.0090381 -0.0440159 0.0561237 -0.0355095 0.1340552 0.102931 0.0452375 0.102913 0.0839427 0.0088804 0.0560488 0.0441281 0.0451783 0.0839034 -0.1028432 0.0355847 -0.1028376 0.1342311 0.0088736 -0.0562557 -0.043985 -0.0453641 0.0838891 -0.1027942 -0.0354592 -0.1027737 0.1342887 unknown
polarizability: 153.7941876|0.0348784|25.0100596|-0.1056433|-0.0008387|25.0033599 unknown
InChI: InChI=1S/C5H4/c1-3-5-4-2/h1-2H2
charge 0 multiplicity 1
9 atoms
C  2.634569 0.000681 -0.002398
C  -2.634595 -0.000592 0.002155
C  1.297968 -0.000021 -0.000591
C  -1.297994 -0.000887 0.001184
C  -0.000012 -0.000338 0.000809
H  3.2089 -0.577502 0.732808
H  3.206334 0.579526 -0.739084
H  -3.207091 0.736024 0.580366
H  -3.208179 -0.736991 -0.57525
