program: Gaussian 09
title: 000138276
version: EM64L-G09RevD.01
frameworkgroup: C1[X(C10H12O3)]
method: RPBEPBE
basis: SDD
operation: Freq
keyword: #pfreq=noraman
keyword: PBEPBE/SDD
title: #p freq=noraman PBEPBE/SDD
converged: YES YES NO NO
title: Mulliken charges:
elementType: O O O C C C C C C C C C C H H H H H H H H H H H H
charge: -0.267951 -0.409712 -0.234395 0.452332 0.354656 -0.564335 0.180607 -0.622539 -0.382039 -0.350511 -0.790091 0.212088 -0.536992 0.241905 0.240048 0.237818 0.248135 0.238589 0.214316 0.239135 0.237998 0.220508 0.221531 0.243747 0.375152
chargesum: 0.00000
title: Mulliken charges with hydrogens summed into heavy atoms:
elementType: O O O C C C C C C C C C C
charge: -0.267951 -0.034560 -0.234395 0.452332 0.354656 -0.322430 0.180607 -0.144673 -0.133904 -0.111922 -0.098642 0.212088 0.148794
polarizability: 1.58143750e+02 1.09694559e+00 1.23413597e+02 7.65181919e+00 -1.86196646e+00 7.44304077e+01
1716.lowfreq: 0.0001 0.0006 0.0009 0.9590 5.6204 9.2546 17.2654 34.0237 59.6012
frequency: 16.8315 34.0038 59.5764 100.7173 122.9738 153.5243 198.1488 215.3086 241.3944 245.1819 331.0046 353.9763 397.4026 441.1296 444.7154 491.1117 524.0308 556.1513 573.3847 621.0931 675.7526 723.8749 731.1837 768.0827 808.0293 847.3577 906.0283 911.0115 939.4725 946.6135 988.0995 1002.2507 1047.6109 1057.0200 1112.4339 1131.2113 1146.4277 1176.6631 1180.9170 1215.3222 1248.4112 1274.4224 1292.2942 1316.3338 1386.4998 1402.1094 1417.1356 1436.4079 1454.9945 1456.8076 1467.0664 1470.7893 1477.7716 1499.9640 1594.1820 1619.1792 1662.8016 2958.9043 2982.4244 3028.6219 3046.6583 3060.2637 3091.0925 3101.9773 3123.5525 3123.6912 3135.4678 3165.0933 3507.7536
redmass: 4.4435 8.5328 4.9603 2.5576 1.2326 3.5461 3.2827 3.5280 3.0579 1.1628 3.7120 4.7737 2.5631 3.5997 2.9123 3.9045 4.1324 3.0255 3.6697 1.8589 2.6111 3.6228 4.9302 4.1757 1.7155 2.9733 1.5672 2.4759 1.3846 2.4425 8.1313 1.5938 1.5319 1.9168 1.2619 2.1264 1.4841 1.4453 1.2099 2.1290 3.2814 1.4270 1.5757 2.1730 4.0811 1.3750 2.4405 1.2134 1.0999 1.0466 1.0521 1.2250 1.1616 2.0714 7.5205 6.1198 8.4655 1.0329 1.0364 1.0599 1.1038 1.0968 1.1003 1.1031 1.0923 1.0987 1.0891 1.0945 1.0639
irintensity: 0.8757 2.5160 1.8285 2.0780 1.1311 5.7473 2.2069 1.5003 1.3372 0.1098 0.6979 1.0714 4.6521 0.5121 3.0695 8.5346 36.4028 7.1037 30.8840 111.1405 56.3480 6.1684 6.0397 11.3225 48.3968 10.5173 7.6507 14.0386 0.9311 15.4572 37.0258 17.0569 5.0093 205.0815 0.1812 88.5996 3.8450 12.5471 13.7561 82.0108 80.4160 2.3525 2.9049 61.1361 7.2210 14.7106 8.4644 7.4356 19.2777 14.6335 14.5975 43.3299 24.5446 95.5461 0.4523 27.7980 223.0714 68.7325 29.0037 16.1170 46.8429 18.5125 18.9019 4.4623 17.5224 22.7861 6.4557 11.3128 19.3138
temp: 298.150 k
press: 1.00000 atm
elementType: 8 8 8 6 6 6 6 6 6 6 6 6 6 1 1 1 1 1 1 1 1 1 1 1 1
symmnumber: 1
zpe: 521809.3 jmol-1
zpe.correction: 0.198747 hartree
zpe.thermalcorrener: 0.211989 hartree
zpe.thermalcorrenthalpy: 0.212933 hartree
zpe.thermalcorrgfe: 0.157038 hartree
zpe.sumelectzpe: -612.964146 hartree
zpe.sumelectthermal: -612.950903 hartree
zpe.sumelectthermalent: -612.949959 hartree
zpe.sumelectthermalfe: -613.005855 hartree
dipole: -1.5218 0.0744 0.0459
dipole: 1.5243
quadrupole: -69.4830 -74.4269 -74.7290
quadrupole: 12.0757 0.6113 -1.2748
quadrupole: 3.3966 -1.5473 -1.8493 12.0757 0.6113 -1.2748
hfenergy: -613.1628926 hartree
pointgroup: C01 [X(C10H12O3)]
dipole: 0.5970232 -0.0555828 -0.0107074 debye
dipolederiv: -1.5640652 -0.3309718 0.3560822 -0.2011043 -0.3895032 0.064633 0.3978022 0.1085227 -0.398092 -0.6391461 -0.3243146 -0.049619 -0.3964563 -0.879465 -0.2589324 -0.2210346 -0.3441736 -0.406508 -0.5671063 0.1685266 -0.1472066 0.1146201 -0.8809212 0.0120261 -0.3315498 0.2345787 -0.4989183 0.279133 -0.0482574 0.0067436 0.0435815 -0.1198574 0.0144976 -0.1369905 0.0419702 -0.1277754 -0.197468 -0.155937 0.0480223 -0.3622272 0.2224709 0.0764108 0.078986 0.0215875 -0.0519895 -0.004739 0.0577141 -0.0756646 -0.0255062 0.0390749 -0.0182582 -0.0637079 -0.0195544 -0.1451908 1.3435028 0.1811099 -0.3603196 -0.021172 -0.0785179 0.0120363 -0.3843935 -0.0434141 0.1676162 -0.2701331 0.0578539 -0.1844786 0.0805282 0.0708811 0.0156503 -0.1508755 0.0173614 0.0041095 -0.0056034 0.0775023 -0.0583886 -0.0337187 0.0570535 -0.0065697 -0.0368015 -0.0657698 -0.1362477 -0.2865134 -0.0757607 0.0163276 0.2449663 0.0072027 -0.0735642 0.0126074 0.0075331 -0.1830611 -0.0313285 0.1518722 0.0144763 0.1101666 -0.0145395 -0.0285245 0.0279727 -0.0341544 0.0617037 0.8520117 0.0848473 0.486488 0.1492754 1.4226174 0.1233426 0.9070894 0.0056615 0.7086462 0.5510362 0.1753754 -0.0708624 0.47979 0.463046 -0.1355996 -0.1082957 -0.0631225 0.3539625 0.0479929 -0.0813466 0.0422354 -0.0834326 -0.0506866 0.0352756 0.032081 0.0342259 0.1234244 0.0243615 0.0092595 0.0207218 0.0656709 -0.0068057 -0.1088541 0.0328404 -0.0459202 0.0183778 0.0555442 -0.0110184 0.0125725 -0.0720898 -0.0365044 0.0957851 0.0064799 0.0434559 0.0564251 0.0478257 0.0851052 0.0337272 0.085744 -0.0242925 -0.0098005 0.0196214 -0.0020723 0.1344766 0.0352007 -0.0841006 0.0387962 -0.0912997 -0.0423585 0.0398736 0.0507983 0.0391654 0.1466938 -0.0005185 -0.1608387 0.043185 -0.0524019 -0.0713405 0.0275955 0.0335844 0.0575665 0.0891569 0.0747409 0.0424358 0.0678394 0.0416996 0.0443887 -0.0030479 0.0805831 -0.0692998 -0.0853773 -0.0428621 0.0601909 -0.111432 0.0204696 0.0462186 -0.0211024 -0.1174497 0.0295819 0.0242947 0.0689024 0.0055271 0.0248252 -0.153246 -0.0744056 -0.0627042 -0.0333564 -0.1210358 -0.0858459 0.0282178 0.0603925 -0.1119539 -0.0964644 -0.0420632 0.1237765 -0.0307635 0.0948571 -0.0716781 -0.1367075 0.011998 0.0744706 0.0661306 0.0752263 -0.0166716 0.0732358 -0.0001521 0.0994529 0.3377213 0.0428351 -0.1165879 0.0864761 0.2630811 0.1027264 -0.1384633 0.0726015 0.2023438 unknown
polarizability: 156.973203|-1.7784502|123.1683056|-12.3849733|-3.8675833|75.8462463 unknown
InChI: InChI=1S/C10H12O3/c1-7-5-8(6-10(11)12)3-4-9(7)13-2/h3-5,11H,6H2,1-2H3
charge 0 multiplicity 1
25 atoms
O  3.188542 -0.128707 -0.611938
O  -3.74659 -0.866938 -0.683436
O  -3.520032 1.44511 -0.657501
C  -0.866575 0.056254 0.605206
C  1.183076 -1.230903 0.073807
C  -0.167368 -1.171508 0.479331
C  1.84411 -0.000574 -0.216744
C  -2.334729 0.076499 1.036383
C  -0.186474 1.257705 0.304817
C  1.165043 1.235702 -0.104366
C  1.928012 -2.542796 -0.055304
C  -3.243886 0.333304 -0.156671
C  3.921104 1.098132 -0.931461
H  -0.689955 -2.110906 0.698783
H  -2.511001 0.890373 1.760921
H  -2.613477 -0.882477 1.500784
H  -0.71404 2.215421 0.379596
H  1.671788 2.178555 -0.330268
H  1.272688 -3.396127 0.188811
H  2.318069 -2.679063 -1.080649
H  2.807039 -2.570091 0.614886
H  3.981898 1.771698 -0.054356
H  3.454929 1.63663 -1.779557
H  4.930731 0.764888 -1.213552
H  -4.292904 -0.666381 -1.491923
