program: Gaussian 09
title: 000138118
version: EM64L-G09RevD.01
frameworkgroup: C1[X(C3H8Si)]
method: RPBEPBE
basis: SDD
operation: Freq
keyword: #pfreq=noraman
keyword: PBEPBE/SDD
title: #p freq=noraman PBEPBE/SDD
converged: YES YES NO NO
title: Mulliken charges:
elementType: Si C C C H H H H H H H H
charge: 1.123111 -1.058805 -1.058832 -0.988167 0.255100 0.252551 0.252969 0.255082 0.252493 0.253015 0.230727 0.230755
chargesum: 0.00000
title: Mulliken charges with hydrogens summed into heavy atoms:
elementType: Si C C C
charge: 1.123111 -0.298185 -0.298242 -0.526684
polarizability: 5.82244271e+01 5.12157476e-02 7.74015196e+01 3.50178601e-03 2.64795442e-02 4.15108436e+01
1716.lowfreq: -20.5179 0.0031 0.0034 0.0035 16.4872 17.6194 85.8367 106.8746 165.7647
frequency: 85.4486 106.8716 165.7229 199.7051 220.2843 543.9977 598.5926 705.9073 733.3785 735.3078 835.4925 866.7171 874.5234 886.6142 1006.4752 1306.7632 1312.4324 1382.8558 1443.0413 1449.2575 1454.0077 1456.5606 2984.5398 2985.6220 3077.2525 3077.9238 3100.2256 3102.7184 3102.7927 3210.2136
redmass: 1.0220 1.0849 3.6969 2.5195 2.3768 1.0080 4.1715 2.2756 1.2409 1.4245 1.1829 1.2732 1.5406 1.6637 3.3877 1.1910 1.1795 1.1665 1.0555 1.0514 1.0493 1.0478 1.0344 1.0343 1.0980 1.0981 1.0561 1.0981 1.0982 1.1118
irintensity: 0.0000 0.0149 0.5784 0.0594 6.9563 0.0000 2.9677 1.5953 135.6189 9.5217 0.0014 2.0441 16.3655 130.2222 67.2959 41.7484 15.4957 14.0153 0.0038 5.4592 30.3864 15.0054 15.5398 10.2634 0.0810 19.1212 2.4687 10.9959 7.6067 6.2664
temp: 298.150 k
press: 1.00000 atm
elementType: 14 6 6 6 1 1 1 1 1 1 1 1
symmnumber: 1
zpe: 257264.4 jmol-1
zpe.correction: 0.097987 hartree
zpe.thermalcorrener: 0.105011 hartree
zpe.thermalcorrenthalpy: 0.105955 hartree
zpe.thermalcorrgfe: 0.067600 hartree
zpe.sumelectzpe: -408.131887 hartree
zpe.sumelectthermal: -408.124863 hartree
zpe.sumelectthermalent: -408.123919 hartree
zpe.sumelectthermalfe: -408.162274 hartree
dipole: -0.0046 -1.7430 -0.0012
dipole: 1.7430
quadrupole: -31.8852 -34.5622 -35.5055
quadrupole: -0.0061 0.0014 -0.0019
quadrupole: 2.0991 -0.5779 -1.5212 -0.0061 0.0014 -0.0019
hfenergy: -408.2298738 hartree
pointgroup: C01 [X(C3H8Si1)]
dipole: -0.0020918 -0.682202 -0.0695523 debye
dipolederiv: 1.2229698 -0.009006 0.080454 -0.0091659 0.8615246 0.0582969 0.0809555 0.0568811 0.2821329 -0.4313218 -0.0643076 -0.0356155 -0.0050624 -0.3504408 -0.0271745 -0.0293697 -0.0328345 -0.0939782 -0.4308619 0.0703674 -0.0219789 0.0111957 -0.3525169 -0.0251642 -0.0282852 -0.017762 -0.0922738 -0.5410823 -0.0006878 0.0105467 -0.0005115 -0.3701049 0.0302052 0.0103358 0.0300139 -0.661934 -0.0910995 0.0977378 -0.0063109 0.0832107 0.0547912 -0.0002932 -0.0077346 0.0016108 0.1146268 0.0992805 -0.0591401 0.0002269 -0.0464087 -0.0092507 0.1030031 0.0308373 0.1106802 0.0084018 0.1023737 -0.0414038 0.0078982 -0.0249427 0.0378699 -0.1013958 -0.0199145 -0.1112368 -0.0419668 -0.0920023 -0.0937492 -0.0254351 -0.0793103 0.0582639 -0.0111065 -0.0242317 -0.0131093 0.1119565 0.0999801 0.0572665 0.0114892 0.0390271 0.0325672 -0.0981796 0.0389369 -0.1060827 -0.0338957 0.1025736 0.0388243 0.0165355 0.0278911 -0.007107 0.108381 -0.0139377 0.1183663 0.0025011 -0.0211071 -0.0739854 -0.0265418 -0.1378411 0.0247131 -0.0299074 -0.0331323 -0.0245906 0.20033 -0.0197029 0.0780839 -0.0112683 0.141918 0.0196903 -0.0066651 -0.0044599 -0.0119363 0.2040994 unknown
polarizability: 58.1050417|-0.0842407|77.034104|1.4064729|3.6065378|41.9976446 unknown
InChI: InChI=1S/C3H8Si/c1-4(2)3/h1H2,2-3H3
charge 0 multiplicity 1
12 atoms
Si -0.00144 0.092424 -0.138051
C  -1.607536 -0.90539 -0.374242
C  1.598941 -0.941349 -0.105105
C  0.00367 1.824382 0.038734
H  -2.481382 -0.231225 -0.370147
H  -1.741522 -1.647233 0.434563
H  -1.601412 -1.454981 -1.333585
H  2.476269 -0.284322 0.02436
H  1.729737 -1.509003 -1.044832
H  1.589276 -1.670063 0.726388
H  0.929681 2.395934 0.174553
H  -0.918582 2.417427 0.020264
