program: Gaussian 09
title: 000137031
version: EM64L-G09RevD.01
frameworkgroup: C1[X(C5H8)]
method: RPBEPBE
basis: SDD
operation: Freq
keyword: #p
keyword: freq=noraman
keyword: PBEPBE/SDD
title: #p freq=noraman PBEPBE/SDD
converged: YES YES NO NO
title: Mulliken charges:
elementType: C C C C C H H H H H H H H
charge: -0.533853 -0.434355 0.308734 -0.364374 -0.790845 0.221320 0.221338 0.214419 0.214417 0.248448 0.233402 0.227967 0.233383
chargesum: 0.00000
title: Mulliken charges with hydrogens summed into heavy atoms:
elementType: C C C C C
charge: -0.091195 -0.005519 0.308734 -0.115926 -0.096094
polarizability: 6.21471330e+01 3.71910397e+00 5.37286884e+01 1.12810012e-02 2.94180284e-03 3.72245990e+01
1716.lowfreq: -148.6059 -14.0303 -0.0010 -0.0009 -0.0006 14.7212 18.3363 214.9008 322.0298
frequency: -148.5772 214.8983 322.0290 396.6874 642.4172 731.8812 855.9614 871.9198 902.9130 960.7724 971.9177 984.8234 1031.4480 1074.0202 1131.1539 1169.6703 1197.9812 1218.1593 1270.6185 1386.1410 1439.5384 1455.6800 1469.1485 1469.8900 1643.7688 2972.7232 2988.3549 3000.0827 3046.4680 3051.4144 3066.3420 3079.4731 3154.4334
redmass: 1.0581 1.9291 2.4309 1.9203 3.6892 1.1615 1.1592 2.8626 2.3484 1.7949 1.2492 2.1033 1.6144 1.3679 1.1906 1.5936 1.5780 1.8144 2.9381 1.2203 1.0847 1.1241 1.0462 1.0687 6.7372 1.0372 1.0557 1.0604 1.1061 1.0977 1.1053 1.0982 1.1019
irintensity: 0.2144 3.7592 1.5903 14.0662 0.3793 27.6897 12.5746 8.2592 5.5574 4.3874 6.2186 0.9733 3.7567 0.0008 0.4812 6.4406 9.8042 0.0074 26.0366 11.2515 4.0625 3.1632 13.0000 9.6642 12.4516 28.6314 54.7915 61.0727 0.1664 20.7375 75.6135 22.0067 21.7145
temp: 298.150 k
press: 1.00000 atm
elementType: 6 6 6 6 6 1 1 1 1 1 1 1 1
symmnumber: 1
zpe: 294118.2 jmol-1
zpe.correction: 0.112024 hartree
zpe.thermalcorrener: 0.116819 hartree
zpe.thermalcorrenthalpy: 0.117763 hartree
zpe.thermalcorrgfe: 0.084554 hartree
zpe.sumelectzpe: -194.880594 hartree
zpe.sumelectthermal: -194.875799 hartree
zpe.sumelectthermalent: -194.874855 hartree
zpe.sumelectthermalfe: -194.908064 hartree
dipole: 0.3379 0.2844 0.0011
dipole: 0.4417
quadrupole: -29.8779 -30.5015 -32.0959
quadrupole: -0.0968 0.0016 0.0001
quadrupole: 0.9472 0.3236 -1.2708 -0.0968 0.0016 0.0001
hfenergy: -194.9926179 hartree
pointgroup: C01 [X(C5H8)]
dipole: 0.1327802 -0.1121057 -0.0005757 debye
dipolederiv: -0.1601638 0.050046 -0.0000636 0.0102988 -0.0331544 -0.000299 0.0002626 -0.0002756 0.2219853 -0.0154595 0.0421317 0.0000795 0.0699661 -0.080059 -0.0004213 0.0002224 -0.0004012 0.2346571 0.4240124 -0.0972761 -0.0005745 0.0853363 0.107072 0.0004754 -0.0014763 0.0012912 -0.1733247 -0.085514 0.1079029 0.0002081 0.0467978 0.0499858 0.0003464 0.0000444 0.000456 -0.3230919 -0.2263963 -0.020944 0.0001913 -0.1078153 0.0813346 -0.0000849 0.0021723 -0.0011275 0.1168206 0.0849148 -0.0210573 0.0071687 -0.0080448 -0.0661468 -0.1130355 -0.0063643 -0.1534567 -0.0759743 0.0847301 -0.0209689 -0.0072516 -0.0081033 -0.0666952 0.1130067 0.0063472 0.1533891 -0.0753516 -0.0893898 0.0075803 0.1178594 -0.034966 0.0896608 -0.0018424 0.165929 -0.0074751 -0.0787021 -0.0893195 0.0078321 -0.1177896 -0.0345817 0.0895638 0.0022954 -0.1660309 0.00786 -0.0787305 0.0698259 -0.0614218 -0.000144 -0.0478064 -0.1493747 -0.0004139 -0.0001399 -0.0005897 0.2133673 -0.0212077 -0.0126532 0.0491262 -0.0385825 0.054052 0.0964103 0.1144999 0.0762555 -0.0481538 0.0449357 0.0330296 -0.0001659 0.1083167 -0.1268515 0.002069 -0.0014049 0.0020685 0.111087 -0.0209684 -0.0142014 -0.048644 -0.0408158 0.0506125 -0.0985062 -0.1140616 -0.0779946 -0.0445885 unknown
polarizability: 62.1354565|-3.7322583|53.7403327|-0.0170379|0.0228286|37.2246312 unknown
InChI: InChI=1S/C5H8/c1-5-3-2-4-5/h3H,2,4H2,1H3
charge 0 multiplicity 1
13 atoms
C  -0.544795 -1.079973 -0.001184
C  -1.614746 0.093153 0.000125
C  0.52356 0.032157 0.000233
C  -0.405143 1.041627 0.001317
C  2.027506 -0.046854 -0.000154
H  -0.563552 -1.723347 -0.900909
H  -0.563552 -1.725341 0.897105
H  -2.257466 0.127466 0.898931
H  -2.257324 0.129582 -0.898697
H  -0.330797 2.133315 0.002695
H  2.46061 0.440305 -0.894506
H  2.368651 -1.096982 0.008616
H  2.462048 0.456091 0.884628
