program: Gaussian 09
title: 000136425
version: EM64L-G09RevD.01
frameworkgroup: C1[X(C10H11F3O)]
method: RPBEPBE
basis: SDD
operation: Freq
keyword: #p
keyword: freq=noraman
keyword: PBEPBE/SDD
title: #p freq=noraman PBEPBE/SDD
converged: YES YES NO NO
title: Mulliken charges:
elementType: F F F O C C C C C C C C C C H H H H H H H H H H H
charge: -0.169283 -0.165864 -0.167276 -0.462300 -0.211762 0.510160 -0.402181 -0.473080 0.298772 -0.426127 -0.687605 -0.353858 -0.212285 0.246512 0.200220 0.233127 0.192427 0.297074 0.241611 0.204977 0.225976 0.238892 0.264177 0.236743 0.340953
chargesum: 0.00000
title: Mulliken charges with hydrogens summed into heavy atoms:
elementType: F F F O C C C C C C C C C C
charge: -0.169283 -0.165864 -0.167276 -0.121347 -0.011542 0.510160 0.023374 -0.176006 0.298772 -0.184516 -0.017760 -0.089682 0.024458 0.246512
polarizability: 1.37913230e+02 -5.48513873e+00 1.17673459e+02 -2.85393415e+00 -2.56543907e+00 7.29153737e+01
1716.lowfreq: -12.5628 -9.8054 -0.0009 -0.0008 -0.0006 2.9159 15.8821 23.0807 82.5638
frequency: 15.7448 22.1826 82.5328 109.1870 121.1679 133.9025 218.4847 221.0416 231.6387 287.1167 299.0527 321.4574 352.1654 363.6658 369.9258 430.2562 469.6382 505.3538 512.1987 593.7262 609.3526 632.4923 685.7516 705.6232 777.2440 809.0468 851.0288 889.8742 929.0261 939.0577 983.3553 987.0095 989.1963 990.8346 1013.7073 1036.5413 1055.9780 1072.8911 1097.0858 1111.4097 1156.0430 1186.4753 1217.2794 1245.9117 1280.9863 1287.6390 1307.8577 1326.9490 1385.5447 1390.7728 1403.8790 1440.9349 1459.8482 1474.4924 1480.2394 1485.8259 1602.5928 1620.7507 2941.6746 2962.7391 2980.9044 3035.9852 3075.4408 3087.5477 3127.3168 3151.8318 3172.2329 3176.5404 3563.6523
redmass: 12.0357 4.1360 2.8801 3.1213 7.6477 2.9905 1.9752 3.1926 2.2252 1.1984 4.9975 8.3514 3.4693 5.9827 4.1004 5.8498 4.4954 4.6230 10.4795 4.3173 11.0202 5.2478 5.7064 2.0134 1.7113 1.5826 1.8815 2.1914 1.4364 1.4984 6.9938 4.3805 2.4379 2.5051 6.2207 2.5974 2.8149 1.7785 1.9488 1.7540 1.5490 1.0899 1.3768 1.2776 1.9569 1.3043 1.5112 1.3975 3.0180 1.3622 2.0413 2.9969 1.1283 1.0496 2.3036 1.0853 6.2139 6.3551 1.0843 1.0635 1.0370 1.0972 1.0990 1.1001 1.0886 1.0913 1.0973 1.0932 1.0660
irintensity: 0.0292 0.5319 0.1137 0.7433 0.2169 2.8169 3.5332 3.9520 1.7290 126.8964 7.0167 5.3869 12.7865 8.3451 3.2781 0.8622 4.8077 3.3553 2.0981 10.2821 14.6212 1.1949 0.3922 32.8871 38.5229 71.2535 9.4172 30.2853 7.2244 67.4482 44.5769 174.6965 14.2145 15.5009 152.5237 59.7672 41.2774 13.4595 12.7785 11.7912 53.1235 0.6635 65.1391 16.2514 166.4329 68.0607 34.8066 2.4728 1.3008 17.9783 8.5324 20.9333 4.7082 11.7247 4.3457 12.7323 3.6511 3.6507 42.6490 48.5216 24.4879 15.3030 47.7153 43.9887 8.6481 9.8066 6.5310 3.5528 5.1045
temp: 298.150 k
press: 1.00000 atm
elementType: 9 9 9 8 6 6 6 6 6 6 6 6 6 6 1 1 1 1 1 1 1 1 1 1 1
symmnumber: 1
zpe: 495593.9 jmol-1
zpe.correction: 0.188762 hartree
zpe.thermalcorrener: 0.202649 hartree
zpe.thermalcorrenthalpy: 0.203593 hartree
zpe.thermalcorrgfe: 0.146148 hartree
zpe.sumelectzpe: -761.364460 hartree
zpe.sumelectthermal: -761.350573 hartree
zpe.sumelectthermalent: -761.349629 hartree
zpe.sumelectthermalfe: -761.407074 hartree
dipole: 5.5498 1.9325 0.3937
dipole: 5.8898
quadrupole: -77.2320 -74.5116 -86.1952
quadrupole: -6.7898 0.1994 -2.3250
quadrupole: 2.0810 4.8014 -6.8823 -6.7898 0.1994 -2.3250
hfenergy: -761.5532218 hartree
pointgroup: C01 [X(C10H11F3O1)]
dipole: -2.1166761 0.5684242 -0.7523948 debye
dipolederiv: -0.7904617 -0.015742 0.2372346 -0.012245 -0.3186303 0.0783527 0.203588 0.0821485 -0.5043726 -0.6308098 0.0799878 -0.2619307 0.0860866 -0.334238 -0.0477128 -0.337315 -0.0251598 -0.7635618 -0.4276159 0.0651006 -0.0366758 0.0858933 -0.8388408 -0.0524655 -0.066583 -0.0133392 -0.2987365 -0.2659549 0.0672941 0.0612093 0.0391198 -0.5412692 0.1041761 0.1104472 0.1458087 -0.8420833 0.3700887 -0.0066182 -0.0541625 0.032753 0.4451446 -0.0988993 -0.1853371 -0.1876175 0.603507 0.1896437 0.1788207 -0.0103073 0.141746 -0.0514205 0.0463222 -0.0362485 0.0126855 -0.098181 0.0770284 0.0021855 -0.0808496 -0.0369778 0.0205209 -0.0372276 0.0800276 0.0684863 -0.0383701 -0.0935119 -0.1425968 0.0227157 0.0281555 -0.0155946 -0.0324477 -0.0713431 -0.0496979 -0.0613448 -0.3089334 0.1342481 -0.0466875 0.209055 -0.1455343 -0.0158557 0.0256683 -0.053253 -0.1333423 0.0330333 -0.0713581 0.0057208 -0.0770894 -0.010931 -0.0549339 0.0366767 -0.0373799 -0.1129015 0.0742919 -0.0159307 -0.030026 -0.0413979 0.0381505 0.0130748 -0.0476103 0.0498054 -0.0594888 0.0189626 0.0693372 -0.0478736 -0.1096002 -0.0459913 -0.0294939 0.0072346 -0.0298413 -0.1066164 -0.1327426 -0.0352656 0.006163 0.0245275 0.1177656 -0.0898175 -0.0154383 -0.0916526 -0.0995708 1.9981055 -0.259386 0.1033537 -0.3346086 1.4907281 0.0218575 0.2086348 -0.0141917 1.5390398 -0.1046321 0.0909683 0.0261985 0.1032521 -0.125756 -0.005292 0.011978 0.0111332 -0.0175255 -0.0227916 0.129242 0.0180307 0.0941006 -0.0231892 -0.0309573 -0.0047061 -0.0082923 0.0342897 -0.1391026 -0.1459904 0.0681816 -0.1437666 -0.0170364 0.0460802 0.0408644 0.0517224 -0.0178676 0.1587316 0.0139556 0.0004137 0.004526 0.0398776 0.0321086 -0.0092393 0.0305711 0.1366041 -0.0679017 0.0920498 -0.01555 0.0784601 0.0739899 0.0316897 -0.0101719 0.0267587 0.12816 -0.0183167 0.1145696 0.0276262 0.1449803 -0.0472073 -0.000197 0.0738533 -0.0504146 0.0574531 0.041313 -0.0475064 -0.0967696 -0.0775819 0.0101853 -0.1132913 -0.1026997 -0.0875538 -0.0777482 -0.0567712 -0.0766563 0.0818913 -0.0601074 0.0184106 0.0744282 0.0944455 0.0537475 0.0740576 -0.0059785 -0.0579198 0.0318488 -0.0485952 0.0916332 0.0285082 0.0329912 0.0318497 0.1463437 0.0761681 -0.0016517 0.00486 -0.0046618 -0.0754221 0.0825142 0.0128157 0.0880335 0.1253178 0.0281577 -0.1611373 -0.0146154 -0.1260241 0.2446546 0.0494794 -0.0525332 -0.0043571 0.3869382 unknown
polarizability: 138.0816799|6.0613553|110.4829053|2.4002595|-16.2073199|79.9374772 unknown
InChI: InChI=1S/C10H11F3O/c1-2-9(14)7-4-3-5-8(6-7)10(11,12)13/h3-6,9,14H,2H2,1H3
charge 0 multiplicity 1
25 atoms
F  3.580191 -0.150109 -0.527043
F  3.081579 -0.298545 1.676049
F  2.400478 -1.926181 0.256917
O  -2.289075 -1.216164 1.718955
C  -2.506033 -0.342329 0.549764
C  -1.171794 0.329562 0.260136
C  -3.033738 -1.175811 -0.65208
C  0.034917 -0.382379 0.449991
C  1.268504 0.223898 0.127185
C  -1.11998 1.653763 -0.237635
C  -3.388979 -0.332408 -1.894193
C  1.320585 1.543608 -0.381957
C  0.117257 2.255727 -0.56116
C  2.547897 -0.522317 0.371677
H  -3.261595 0.436922 0.794077
H  -2.272895 -1.938011 -0.907322
H  -3.940551 -1.722241 -0.315543
H  -0.003433 -1.393893 0.863511
H  -2.049452 2.221094 -0.367347
H  -4.153829 0.431364 -1.656086
H  -3.794632 -0.973494 -2.69672
H  -2.501139 0.188215 -2.293877
H  2.282796 1.999833 -0.633641
H  0.144034 3.280024 -0.946581
H  -3.094013 -1.777732 1.853624
