program: Gaussian 09
title: 000134347
version: EM64L-G09RevD.01
frameworkgroup: C1[X(C6H9NO3)]
method: RPBEPBE
basis: SDD
operation: Freq
keyword: #pfreq=noraman
keyword: PBEPBE/SDD
title: #p freq=noraman PBEPBE/SDD
converged: YES YES NO NO
title: Mulliken charges:
elementType: O O O N C C C C C C H H H H H H H H H
charge: -0.260511 -0.239232 -0.181872 0.024809 -0.291684 -0.481610 -0.409502 0.285038 -0.656177 0.044899 0.242773 0.244282 0.244283 0.247642 0.266306 0.241361 0.230299 0.218524 0.230372
chargesum: 0.00000
title: Mulliken charges with hydrogens summed into heavy atoms:
elementType: O O O N C C C C C C
charge: -0.260511 -0.239232 -0.181872 0.024809 0.195370 0.010315 0.098164 0.285038 0.023018 0.044899
polarizability: 1.14085567e+02 -9.10823222e+00 6.99205022e+01 9.07316755e+00 -2.98782018e+00 5.60660928e+01
1716.lowfreq: -18.8111 -2.3621 -0.0008 -0.0008 -0.0005 6.4489 34.0463 37.2121 47.6392
frequency: 33.8626 36.7242 44.0642 63.2022 81.8858 161.2485 194.2503 209.3994 297.7185 307.5207 328.9647 493.7271 508.7490 535.5998 547.1289 624.5624 781.9263 794.6056 820.2737 856.6897 941.3349 1017.5665 1038.9944 1078.8824 1087.2055 1118.6919 1121.3448 1229.5575 1243.9869 1287.6915 1321.7661 1341.3321 1377.0368 1404.6758 1423.0848 1442.9318 1455.0286 1474.1241 1481.3980 1489.2039 1654.3057 2317.3381 2999.2565 3002.3412 3004.2019 3033.6179 3045.8424 3068.2809 3099.2444 3104.7785 3124.3667
redmass: 6.3531 6.1691 2.0779 4.3355 3.8370 3.2487 1.1720 3.2168 4.5598 4.8599 4.5954 6.0250 10.7172 7.3209 3.0395 4.0636 1.9794 1.3587 1.6230 5.9913 5.3796 1.9115 4.0472 3.2593 1.6118 1.7420 3.0103 1.1549 1.1732 1.0928 1.2434 1.7042 1.3027 1.2126 7.6218 1.0870 1.0927 1.0386 1.0511 1.0937 8.9541 12.4461 1.0551 1.0424 1.0602 1.0605 1.0985 1.1019 1.1003 1.1004 1.1078
irintensity: 0.3297 0.6488 0.2617 2.7577 0.2473 9.7932 0.0512 7.0275 8.1359 22.4540 17.4368 2.5692 16.5998 15.6281 1.7138 4.4097 13.8750 16.2243 4.2787 47.7474 11.5942 52.9268 3.8783 124.3492 0.2590 21.0099 246.5927 5.6157 0.1027 2.8735 8.3731 32.7938 18.1709 18.2977 4.2470 35.1407 13.9285 13.2482 16.3690 10.4798 137.5356 907.2185 27.8570 10.7064 21.5313 28.4161 3.8172 8.5640 27.5086 31.0666 12.1828
temp: 298.150 k
press: 1.00000 atm
elementType: 8 8 8 7 6 6 6 6 6 6 1 1 1 1 1 1 1 1 1
symmnumber: 1
zpe: 386103.8 jmol-1
zpe.correction: 0.147059 hartree
zpe.thermalcorrener: 0.158617 hartree
zpe.thermalcorrenthalpy: 0.159561 hartree
zpe.thermalcorrgfe: 0.106954 hartree
zpe.sumelectzpe: -513.682803 hartree
zpe.sumelectthermal: -513.671245 hartree
zpe.sumelectthermalent: -513.670301 hartree
zpe.sumelectthermalfe: -513.722908 hartree
dipole: 3.7225 -2.2715 0.6335
dipole: 4.4066
quadrupole: -70.0299 -63.2707 -55.9646
quadrupole: 1.9721 -0.7455 0.9524
quadrupole: -6.9415 -0.1823 7.1238 1.9721 -0.7455 0.9524
hfenergy: -513.8298621 hartree
pointgroup: C01 [X(C6H9N1O3)]
dipole: -1.3286676 -0.1603093 1.1020777 debye
dipolederiv: -1.3933721 -0.4355578 -0.124796 -0.5265588 -0.6023074 -0.1963663 -0.297152 -0.2214823 -0.5269062 -0.6292255 -0.0543033 0.1938346 -0.1926668 -0.4233374 -0.1407822 -0.1784178 -0.2804079 -0.8076255 -1.0381536 -0.2166177 0.5891392 -0.2792564 -0.3371308 0.2002743 0.6448076 0.1689389 -0.7230361 -1.1836584 -0.1909916 0.443951 -0.1376981 -0.4017822 0.1426032 0.8526608 0.2456037 -0.921135 0.6971534 0.1162666 0.025227 0.0638042 0.2914394 0.0696005 -0.1207495 -0.0668815 0.2196109 -0.182335 -0.0901936 0.1129722 -0.0713701 0.0841937 -0.0242529 0.2126998 0.0152678 -0.072407 0.7615808 0.148703 -0.1699104 0.1235743 0.240955 -0.0709758 -0.2922014 -0.0365068 0.430151 1.3958854 0.4692176 -0.0970716 0.7187748 0.6086431 0.3394695 0.4075837 0.5112025 1.052814 0.0147919 -0.0347706 -0.0312717 -0.0236968 0.044132 -0.0329857 -0.0008257 -0.0211696 0.0307684 1.4624535 0.3372697 -0.9841708 0.3913089 0.4291551 -0.3246433 -1.2260069 -0.3418033 1.2663269 -0.0043712 -0.0024463 -0.0264698 0.0284675 0.071879 0.0126506 0.0457803 0.0996194 -0.0615987 0.0093737 -0.0507444 -0.0231883 -0.0403314 -0.0504672 -0.0613608 -0.0123182 -0.0867857 0.0543598 0.0307698 0.0112285 -0.0712424 -0.0146145 0.0651812 0.0876607 -0.0785115 0.0556967 -0.0349458 0.0383549 0.0172382 0.0257446 0.0244472 -0.0747955 -0.0717864 -0.0135497 -0.0601722 0.1003591 -0.0306773 -0.0699396 0.0553044 -0.0793112 -0.0405137 -0.0267107 0.0062461 -0.0878306 0.0422452 0.0256247 -0.0014591 0.0135307 -0.0108626 0.0723037 0.0424225 0.0327073 0.0745997 -0.0883368 0.0607845 0.1070769 0.0174596 0.0575574 -0.082125 -0.0581414 -0.012582 -0.068606 0.0751277 -0.1249446 -0.0706706 0.0914072 -0.0626065 0.0855245 0.0111276 0.1218146 0.0247728 0.0248854 0.0899652 0.0106941 -0.0404494 0.0310387 0.0190526 0.1021967 -0.0919855 0.0759443 -0.0606575 unknown
polarizability: 106.0829912|15.49613|60.2112559|-17.1752091|-1.3794712|73.7779152 unknown
InChI: InChI=1S/C6H9NO3/c1-2-6(9)10-4-3-7-5-8/h2-4H2,1H3
charge 0 multiplicity 1
19 atoms
O  -0.904546 0.716727 0.859741
O  -1.406995 -0.408379 -1.123459
O  4.433535 1.007455 -1.565941
N  2.752973 0.40834 0.091442
C  0.402206 1.11971 0.284516
C  -3.045643 -0.3628 0.742037
C  1.430749 -0.018954 0.487296
C  -1.740947 -0.056418 0.02859
C  -4.027505 -1.167896 -0.126937
C  3.541847 0.693829 -0.793392
H  0.282579 1.348871 -0.789162
H  0.694242 2.019669 0.846578
H  -2.799478 -0.904233 1.676062
H  -3.488029 0.598384 1.066344
H  1.115771 -0.904523 -0.09652
H  1.453629 -0.296677 1.555404
H  -3.583135 -2.126259 -0.445199
H  -4.950868 -1.381515 0.439292
H  -4.299087 -0.611131 -1.039891
