program: Gaussian 09
title: 000133700
version: EM64L-G09RevD.01
frameworkgroup: C1[X(C11H11N5O2)]
method: RPBEPBE
basis: SDD
operation: Freq
keyword: #p
keyword: freq=noraman
keyword: PBEPBE/SDD
title: #p freq=noraman PBEPBE/SDD
converged: YES YES NO NO
title: Mulliken charges:
elementType: O O N N N N N C C C C C C C C C C C H H H H H H H H H H H
charge: -0.428149 -0.226236 -0.061661 -0.622407 -0.287349 -0.020215 0.028558 -0.570736 0.346808 0.126551 -0.133015 0.069727 -0.429810 -0.356746 -0.387826 0.095206 -0.334988 0.213962 0.207170 0.262019 0.245820 0.292835 0.233783 0.313032 0.228842 0.308341 0.276788 0.224653 0.385042
chargesum: 0.00000
title: Mulliken charges with hydrogens summed into heavy atoms:
elementType: O O N N N N N C C C C C C C C C C C
charge: -0.043106 -0.226236 -0.061661 -0.037278 -0.062696 -0.020215 0.028558 -0.101547 0.346808 0.126551 0.112804 0.069727 -0.136975 -0.122962 -0.074793 0.095206 -0.106146 0.213962
polarizability: 2.74621289e+02 -3.36662236e+01 1.53840481e+02 -2.24889634e+01 1.29654637e+01 9.10267061e+01
1716.lowfreq: -3.3376 -0.0004 -0.0004 0.0005 4.2231 6.0531 12.8524 17.6945 30.8349
frequency: 12.7489 17.1286 30.8193 35.9808 57.0416 65.1971 70.2482 80.6768 98.1992 111.8968 160.9399 211.5422 238.6081 247.9035 260.2820 282.9850 334.1100 345.2750 379.0998 416.1883 460.1635 472.2195 482.2087 540.6472 576.2606 591.7932 616.7985 632.2146 666.1800 700.8174 709.8437 728.5566 756.3170 778.2125 784.3136 812.8576 876.3535 882.8840 910.9520 912.7938 955.6856 966.2024 985.2814 1030.3172 1047.8358 1079.7446 1087.4197 1108.2298 1140.7022 1168.9210 1191.2644 1232.5267 1244.8266 1262.1642 1283.8085 1300.8732 1324.3110 1343.0861 1355.7922 1383.4326 1391.8040 1435.4781 1452.6151 1503.6422 1556.8811 1608.6056 1631.0555 1657.9976 1675.1612 2180.4237 2875.1018 2992.3497 3063.9266 3115.3531 3141.5776 3186.4656 3198.8685 3274.9281 3467.3926 3517.0941 3599.8215
redmass: 7.2607 7.5903 8.2075 8.9427 5.7322 9.0005 12.3057 6.2960 12.4326 6.7975 5.5185 3.8339 1.8363 1.8189 3.7819 3.1805 3.8890 5.5415 3.7765 2.8757 4.4123 6.1621 3.6912 3.7616 1.3134 4.3167 2.9952 1.4425 4.0028 5.0482 5.0702 4.3394 2.1240 2.2764 2.8552 5.1912 1.3787 3.1438 1.4416 2.3652 1.4715 1.3336 3.1785 2.8556 2.5486 3.8720 2.3807 2.1290 1.4934 1.2188 1.5258 1.4387 1.3764 1.6700 1.2576 2.1367 1.4063 1.9512 2.4738 2.1559 4.0331 4.1262 1.1583 6.0896 6.4979 8.2966 1.0951 8.7375 9.3588 13.9994 1.0805 1.0624 1.0992 1.0862 1.0987 1.0941 1.0964 1.0749 1.0448 1.0641 1.0988
irintensity: 0.1573 0.7690 0.9224 2.5522 0.8786 1.0743 0.0593 1.6891 0.2410 1.0158 1.2610 3.1721 21.4026 36.3550 0.9080 3.6681 15.6101 6.5163 11.4984 2.7296 25.9738 13.9473 24.4749 12.0820 48.4810 2.2317 44.5210 277.9329 43.0449 4.4284 10.5970 7.7432 4.7608 2.5166 3.8039 19.3640 119.6050 7.8670 10.1246 27.6483 15.6945 0.2108 38.6462 71.2603 316.0924 3.8012 36.2874 21.0570 38.4997 4.0054 12.9876 2.2983 4.7924 33.6448 4.9119 49.0588 28.3921 26.7646 23.2370 5.0631 15.0365 45.8547 20.9373 26.1564 36.0942 17.2700 52.4956 5.7427 191.0926 1.3100 55.2036 26.7467 4.9870 6.1231 21.0736 14.0294 3.6091 16.9608 5.8566 33.0213 5.4026
temp: 298.150 k
press: 1.00000 atm
elementType: 8 8 7 7 7 7 7 6 6 6 6 6 6 6 6 6 6 6 1 1 1 1 1 1 1 1 1 1 1
symmnumber: 1
zpe: 552484.7 jmol-1
zpe.correction: 0.210430 hartree
zpe.thermalcorrener: 0.228942 hartree
zpe.thermalcorrenthalpy: 0.229886 hartree
zpe.thermalcorrgfe: 0.158765 hartree
zpe.sumelectzpe: -848.633425 hartree
zpe.sumelectthermal: -848.614914 hartree
zpe.sumelectthermalent: -848.613969 hartree
zpe.sumelectthermalfe: -848.685091 hartree
dipole: 3.7233 4.8518 1.7796
dipole: 6.3695
quadrupole: -104.7446 -94.9280 -104.4906
quadrupole: -3.9348 8.3301 -3.0522
quadrupole: -3.3569 6.4598 -3.1029 -3.9348 8.3301 -3.0522
hfenergy: -848.8438553 hartree
pointgroup: C01 [X(C11H11N5O2)]
dipole: -1.3628961 -1.9513189 0.7839904 debye
polarizability: 278.5860575|-30.757196|151.9736381|11.4072099|-10.425564|88.9287809 unknown
InChI: InChI=1S/C11H11N3O2.N2/c12-7-1-2-8-6(3-9(13)11(15)16)5-14-10(8)4-7;1-2/h1-2,4-5,9,12,15H,3,13H2;
charge 0 multiplicity 1
29 atoms
O  -4.672552 0.701093 1.89245
O  -3.775113 1.772106 0.040734
N  0.466228 1.793383 -0.734083
N  -4.407357 -1.600669 0.344936
N  4.21917 -1.230981 0.217136
N  6.668258 1.611006 0.204773
N  5.546208 1.751436 0.031158
C  -2.451296 -0.652058 -0.857015
C  -1.108435 0.016881 -0.739992
C  0.134157 -0.568292 -0.481721
C  -3.287898 -0.644099 0.457252
C  1.116788 0.533311 -0.473296
C  -0.825449 1.472274 -0.885768
C  0.581023 -1.923967 -0.253697
C  2.449814 0.315748 -0.243814
C  2.913608 -1.070061 -0.001422
C  1.918957 -2.16647 -0.020793
C  -3.899491 0.736098 0.722995
H  -2.312259 -1.713567 -1.140484
H  -3.060705 -0.178662 -1.647125
H  -2.598886 -0.855172 1.312128
H  -1.584384 2.229951 -1.088727
H  -0.138205 -2.751788 -0.268034
H  3.194084 1.116216 -0.231862
H  2.286866 -3.185091 0.15468
H  -5.065845 -1.562807 1.128771
H  -4.116526 -2.553185 0.107598
H  4.459878 -2.236085 0.37798
H  -5.083437 1.594251 2.049444
