program: Gaussian 09
title: 000140479
version: EM64L-G09RevD.01
frameworkgroup: C1[X(C32H26)]
method: RPBEPBE
basis: SDD
operation: Freq
keyword: #p
keyword: freq=noraman
keyword: PBEPBE/SDD
title: #p freq=noraman PBEPBE/SDD
converged: YES YES NO NO
title: Mulliken charges:
elementType: C C C C C C C C C C C C C C C C C C C C C C C C C C C C C C C C H H H H H H H H H H H H H H H H H H H H H H H H H H
charge: 0.043147 -0.458398 0.332251 0.324468 0.409028 0.452568 0.431209 -0.413791 -0.347196 -0.408759 -0.403204 -0.385292 -0.368806 -0.439972 -0.430063 -0.373061 -0.362337 -0.265244 -0.267156 -0.258870 -0.270180 -0.271947 -0.269403 -0.237992 -0.247954 -0.265209 -0.251367 -0.255140 -0.249113 -0.248369 -0.247938 -0.247629 0.224539 0.278372 0.257300 0.268121 0.298758 0.261321 0.243423 0.237380 0.260074 0.271988 0.263959 0.227149 0.225971 0.223954 0.229772 0.224326 0.224582 0.223812 0.224336 0.224971 0.222896 0.228538 0.226426 0.227721 0.226307 0.225724
chargesum: 0.00000
title: Mulliken charges with hydrogens summed into heavy atoms:
elementType: C C C C C C C C C C C C C C C C C C C C C C C C C C C C C C C C
charge: 0.043147 -0.233858 0.332251 0.324468 0.409028 0.452568 0.431209 -0.135419 -0.089896 -0.140638 -0.104447 -0.123971 -0.125383 -0.202592 -0.169990 -0.101073 -0.098378 -0.038095 -0.041185 -0.034917 -0.040408 -0.047621 -0.044821 -0.014181 -0.023618 -0.040238 -0.028471 -0.026603 -0.022687 -0.020648 -0.021631 -0.021905
polarizability: 3.10071995e+02 -6.04299525e+00 3.61391250e+02 -1.60187147e+01 -6.84664219e-01 3.10619463e+02
1716.lowfreq: -7.1937 -0.0005 -0.0004 0.0006 7.0829 9.6664 24.1642 36.7083 43.2099
frequency: 24.0254 36.6578 43.1754 48.6383 60.5953 64.9622 69.7780 73.4047 77.2777 89.4732 98.4093 129.0752 155.0480 177.4222 231.6284 234.0274 241.3390 246.8680 262.0151 269.1503 281.2256 281.7941 288.0031 320.6252 400.6036 403.1796 404.1344 407.1303 425.5811 469.0171 483.3675 488.9182 510.7969 528.0056 581.9468 601.9894 614.9563 616.2808 617.8415 618.1309 620.0018 625.9843 639.5359 661.7802 699.6145 702.9565 706.2069 706.6684 709.5926 723.1693 749.1444 752.9681 762.2058 768.7425 789.5771 822.4577 826.8357 850.2417 853.9795 855.2082 857.0192 868.1273 896.8687 906.7828 914.1786 930.0918 936.3713 945.5857 949.0032 968.7428 977.4031 979.6008 981.0661 982.8237 990.2419 990.7939 990.9610 991.1862 992.2316 994.1390 995.0050 995.8633 996.0176 1001.3039 1006.9864 1029.1859 1030.4644 1032.0080 1032.9636 1034.4885 1082.8517 1086.4651 1087.8382 1092.4716 1095.2430 1139.0372 1156.3382 1170.4122 1171.0909 1173.0194 1173.3271 1173.8321 1176.6437 1179.0137 1193.7468 1197.0728 1198.0712 1202.9341 1205.5762 1206.8208 1248.0744 1300.4254 1315.6559 1327.7635 1332.0436 1334.6987 1346.8743 1368.2284 1373.2118 1375.7810 1378.7408 1386.5448 1428.0275 1433.9466 1436.2113 1436.6211 1440.8575 1480.4493 1481.2637 1482.4731 1484.3774 1484.9467 1581.6268 1586.7183 1587.3068 1588.1898 1589.8553 1605.5764 1607.0430 1607.4832 1610.7263 1611.6005 3003.4916 3106.0852 3117.3958 3120.8921 3121.3250 3121.6684 3124.2015 3126.5538 3129.7450 3131.4852 3132.0542 3137.4017 3139.1788 3143.1255 3146.8495 3149.5884 3155.1087 3155.5012 3157.7991 3158.7983 3160.3517 3165.0664 3166.3878 3171.9542 3180.3464 3181.7759
redmass: 5.1676 3.8985 4.5533 4.3628 4.9713 4.3636 4.4052 4.3777 4.8306 4.2888 4.3452 3.9540 5.1892 5.0644 4.8554 5.0160 4.9157 4.3902 4.4678 4.6704 4.6893 4.6715 5.0367 4.7092 2.8284 2.8328 2.8313 2.8744 3.0299 3.8264 3.6891 3.9732 3.5771 3.6365 5.6961 5.0319 5.6531 6.3397 6.2638 6.1651 6.2162 5.1793 6.1113 5.5269 4.0580 1.7701 1.6743 1.8203 1.5635 1.6419 2.2673 1.8569 2.0239 2.2538 2.3924 3.1583 4.5489 1.2704 1.2540 1.2538 1.2523 1.2484 2.5536 2.0957 1.5576 1.4952 1.7081 2.1718 1.7158 3.8935 1.4171 1.4091 1.3842 1.4060 3.3009 2.4909 4.9718 5.4672 4.2264 2.3336 1.4238 1.3970 1.3507 1.3562 1.2899 2.3466 2.2576 2.4045 2.3251 2.2361 1.6511 1.6649 1.6398 1.6339 1.6561 3.2089 3.2211 1.1583 1.0718 1.0966 1.0612 1.0748 2.7625 2.1925 1.2411 1.3548 1.2087 1.1495 1.1808 1.3667 1.5424 1.4853 1.4817 1.3889 1.3476 1.2665 1.3565 4.6534 6.5304 7.2489 5.7266 4.4385 2.2575 2.2852 2.2509 2.2310 2.0974 2.0911 2.1444 2.1831 2.1137 2.1358 5.6236 5.8830 5.9207 6.0166 5.7493 5.9574 5.9479 5.9539 5.9816 6.0414 1.0815 1.0877 1.0849 1.0844 1.0844 1.0847 1.0864 1.0870 1.0883 1.0885 1.0892 1.0932 1.0933 1.0940 1.0925 1.0936 1.0949 1.0951 1.0992 1.0992 1.0963 1.1005 1.0987 1.0968 1.0941 1.0931
irintensity: 0.0010 0.0083 0.0216 0.0241 0.0888 0.0695 0.0409 0.1787 0.3045 0.0561 0.4576 0.0161 0.1864 0.3815 0.1429 0.6289 0.7157 0.1255 0.1941 0.1441 0.0353 1.0464 0.4416 0.8674 0.1687 0.3217 0.0183 0.1732 0.1790 4.2615 3.7063 3.5050 0.4580 1.6980 12.2451 10.1010 10.2816 0.2732 0.8695 6.1584 3.4687 26.2530 1.8409 4.3933 8.7892 27.6795 24.0380 45.4890 147.0096 62.4136 45.2044 45.8790 2.6890 10.5911 20.4472 8.6182 0.6017 0.1518 0.2692 0.7902 0.4525 0.2856 3.3111 0.2378 0.5660 4.2046 1.1344 1.2122 2.7448 0.9726 0.0094 0.7843 0.2897 0.6939 1.0361 0.8152 0.5954 1.1527 0.6439 0.2235 0.2905 0.4013 0.0037 0.1484 1.1350 9.4191 12.4526 5.2233 6.1346 13.0202 0.5072 2.5568 13.1137 1.6950 7.6463 1.7440 0.8342 0.1604 0.2720 0.2299 0.7186 0.4443 1.9226 0.7027 1.4452 1.3158 1.9728 4.3225 0.3363 4.3333 0.8429 4.3957 0.8606 0.5471 0.5170 1.8813 4.0757 0.4456 2.9567 1.2689 2.4129 0.7215 2.5392 11.8786 8.9403 9.8053 4.5782 23.8462 8.7700 26.1663 40.0790 18.4692 0.0649 1.7332 1.6201 1.4475 0.7352 9.7551 2.9249 15.7001 5.7375 5.2851 14.0409 8.4379 6.2741 1.4618 0.2296 0.1078 0.8783 1.5829 6.2291 9.2460 9.7390 27.2202 24.5602 39.2821 24.6019 31.5888 0.5356 56.5573 33.4395 26.4467 21.0582 19.8259 15.5535 10.6917 8.4350 5.6550
temp: 298.150 k
press: 1.00000 atm
elementType: 6 6 6 6 6 6 6 6 6 6 6 6 6 6 6 6 6 6 6 6 6 6 6 6 6 6 6 6 6 6 6 6 1 1 1 1 1 1 1 1 1 1 1 1 1 1 1 1 1 1 1 1 1 1 1 1 1 1
symmnumber: 1
zpe: 1240648.0 jmol-1
zpe.correction: 0.472538 hartree
zpe.thermalcorrener: 0.498289 hartree
zpe.thermalcorrenthalpy: 0.499233 hartree
zpe.thermalcorrgfe: 0.416244 hartree
zpe.sumelectzpe: -1232.807631 hartree
zpe.sumelectthermal: -1232.781880 hartree
zpe.sumelectthermalent: -1232.780936 hartree
zpe.sumelectthermalfe: -1232.863925 hartree
dipole: 0.1552 -0.1510 0.0357
dipole: 0.2195
quadrupole: -181.8037 -173.9958 -172.8254
quadrupole: -2.1441 -3.2981 -0.8550
quadrupole: -5.5954 2.2125 3.3829 -2.1441 -3.2981 -0.8550
hfenergy: -1233.2801687 hartree
pointgroup: C01 [X(C32H26)]
dipole: 0.0832763 0.0141138 -0.0178991 debye
polarizability: 330.8530997|27.5788764|336.6877565|8.128145|-14.2755419|314.541851 unknown
InChI: InChI=1S/C32H26/c1-6-16-26(17-7-1)31(27-18-8-2-9-19-27)32(28-20-10-3-11-21-28,29-22-12-4-13-23-29)30-24-14-5-15-25-30/h1-25,31H
charge 0 multiplicity 1
58 atoms
C  0.523246 -0.39819 -0.040957
C  -0.574291 0.447002 0.798023
C  0.249439 -0.303362 -1.568738
C  0.603806 -1.885894 0.436771
C  1.949249 0.152344 0.339415
C  -2.016488 -0.092901 0.856821
C  -0.612609 1.958346 0.466606
C  -0.202554 -1.418168 -2.325012
C  1.570735 -2.729655 -0.180727
C  2.928374 0.527899 -0.612386
C  0.403969 0.931229 -2.259585
C  -0.138594 -2.425001 1.515535
C  2.339295 0.151401 1.708581
C  -2.712852 0.072526 2.085976
C  0.320817 2.845425 1.066642
C  -2.725349 -0.661317 -0.230964
C  -1.602626 2.513706 -0.386468
C  -0.486613 -1.310723 -3.704742
C  1.770017 -4.057792 0.242012
C  4.224406 0.933184 -0.214008
C  0.1166 1.044975 -3.637196
C  0.06155 -3.757916 1.94893
C  3.625735 0.558767 2.113184
C  -4.057237 -0.328003 2.234109
C  0.286882 4.232593 0.800311
C  -4.071782 -1.069479 -0.086751
C  -1.640928 3.899696 -0.654065
C  -0.329979 -0.075672 -4.372281
C  1.011779 -4.584664 1.315026
C  4.580218 0.963937 1.150339
C  -4.746058 -0.908724 1.143467
C  -0.693039 4.768214 -0.066187
H  -0.201602 0.391841 1.838585
H  -0.341654 -2.38533 -1.833049
H  2.18522 -2.331676 -0.996035
H  2.695973 0.495915 -1.679957
H  0.750675 1.817594 -1.722835
H  -0.896025 -1.826466 2.024969
H  1.642362 -0.209173 2.473949
H  -2.191507 0.53102 2.936662
H  1.086832 2.450558 1.741387
H  -2.23583 -0.788024 -1.198258
H  -2.354942 1.861417 -0.839922
H  -0.833109 -2.194086 -4.253299
H  2.522707 -4.678095 -0.257823
H  4.95555 1.219461 -0.978871
H  0.244461 2.014166 -4.132564
H  -0.533872 -4.144835 2.783892
H  3.888645 0.543953 3.177153
H  -4.565493 -0.187648 3.195006
H  1.021665 4.892772 1.275318
H  -4.593337 -1.511753 -0.943567
H  -2.415771 4.300501 -1.317699
H  -0.549904 0.011404 -5.44229
H  1.165068 -5.616334 1.65106
H  5.583505 1.278646 1.458313
H  -5.789421 -1.225716 1.251422
H  -0.724914 5.844611 -0.269829
