program: Gaussian 09
title: 000016296
version: EM64L-G09RevD.01
frameworkgroup: C1[X(C12H16O2)]
method: RPBEPBE
basis: SDD
operation: Freq
keyword: #pfreq=noraman
keyword: PBEPBE/SDD
title: #p freq=noraman PBEPBE/SDD
converged: YES YES NO NO
title: Mulliken charges:
elementType: O O C C C C C C C C C C C C H H H H H H H H H H H H H H H H
charge: -0.285960 -0.257927 -0.342600 -0.385629 -0.352736 -0.270005 -0.692200 0.194242 0.215913 -0.341122 -0.338903 -0.221357 -0.218260 -0.223171 0.190239 0.189607 0.208985 0.208687 0.196597 0.197215 0.228101 0.225454 0.210835 0.210566 0.218005 0.270155 0.269869 0.232975 0.230580 0.231846
chargesum: 0.00000
title: Mulliken charges with hydrogens summed into heavy atoms:
elementType: O O C C C C C C C C C C C C
charge: -0.285960 -0.257927 0.037245 0.032042 0.041076 0.183550 -0.052793 0.194242 0.215913 -0.070967 -0.069034 0.011617 0.012320 0.008675
polarizability: 1.97217593e+02 7.20644310e+00 1.36395362e+02 1.38252635e+00 -9.06285590e-01 7.69482558e+01
1716.lowfreq: -5.6333 -1.1373 -0.0003 0.0003 0.0007 6.6119 23.1589 37.2233 47.7676
frequency: 23.0326 37.1957 47.7563 62.7919 92.5965 104.2175 131.3274 140.2925 206.8110 215.7504 232.0340 245.3004 333.8242 399.9321 404.4410 436.1549 442.6733 510.2745 614.2976 661.3472 680.7707 702.5455 729.4784 762.3412 795.6487 802.1819 842.1902 866.0298 881.0618 924.4675 954.8501 964.0215 990.5591 997.0288 1008.6583 1017.1421 1022.7784 1059.4879 1070.7178 1077.6373 1088.5183 1126.8185 1149.7435 1173.7466 1182.5230 1202.5087 1241.2944 1253.5226 1256.0491 1280.5264 1291.6202 1315.1095 1316.7607 1354.0541 1373.5004 1389.5900 1390.7147 1437.7675 1466.5856 1466.7631 1474.4662 1477.9691 1478.4452 1483.3035 1490.3666 1584.0013 1611.5116 1619.1631 2957.7531 2969.9632 2973.6350 2988.5818 2997.6615 2999.7025 3024.1243 3043.8970 3069.3551 3073.6636 3074.3689 3129.1166 3142.1921 3154.6588 3166.8944 3178.6518
redmass: 3.9199 1.7469 4.4112 4.4490 2.9993 1.9542 3.8325 2.8772 4.0720 5.1960 1.1119 4.2273 4.4961 4.8507 2.8331 3.6076 3.6753 5.2904 6.4414 6.8718 5.0049 1.5899 1.0688 1.1073 2.1911 8.2701 1.1842 1.2440 2.5646 3.5616 1.4191 1.1593 6.2617 1.3824 1.3273 3.6194 2.7380 2.9195 2.3452 2.4280 1.9054 2.6156 1.4858 1.0566 1.1230 1.4288 2.4935 1.5205 1.2283 1.0941 1.0910 1.3389 1.3499 1.5643 1.5672 9.8869 1.2222 2.2463 1.0763 1.0732 1.0864 1.0590 2.0722 1.0915 1.0945 6.9195 6.2476 9.7817 1.0587 1.0591 1.0365 1.0597 1.0988 1.0566 1.1026 1.1041 1.1020 1.0995 1.1064 1.0855 1.0891 1.0940 1.0979 1.0976
irintensity: 0.0035 0.0986 0.4112 1.6841 0.0017 1.0485 0.5020 0.5096 2.8713 4.1531 0.0155 2.0477 8.3064 2.1111 0.0041 9.0844 0.3921 1.1516 0.5187 4.8971 13.7396 94.7842 10.9796 0.1546 22.2303 7.5322 1.0576 0.0253 10.9207 12.0579 4.6911 0.9556 1.1411 0.0537 0.4794 17.2099 59.5830 242.8266 5.1860 22.4249 50.2148 0.7554 0.7278 0.1232 41.8525 0.6363 263.5168 112.1538 1.4323 0.2826 0.6525 6.0871 3.2272 0.3015 1.6969 2.5110 11.9596 15.9820 0.2360 0.1824 4.4022 12.2041 7.2801 0.4368 22.3287 46.3897 12.8005 154.2639 6.4584 52.5318 35.7720 18.1325 0.8724 43.0858 15.7523 10.7478 23.9076 51.4021 125.6814 0.3207 11.8969 16.7147 21.6752 8.4104
temp: 298.150 k
press: 1.00000 atm
elementType: 8 8 6 6 6 6 6 6 6 6 6 6 6 6 1 1 1 1 1 1 1 1 1 1 1 1 1 1 1 1
symmnumber: 1
zpe: 660415.3 jmol-1
zpe.correction: 0.251539 hartree
zpe.thermalcorrener: 0.266177 hartree
zpe.thermalcorrenthalpy: 0.267122 hartree
zpe.thermalcorrgfe: 0.207397 hartree
zpe.sumelectzpe: -616.274997 hartree
zpe.sumelectthermal: -616.260358 hartree
zpe.sumelectthermalent: -616.259414 hartree
zpe.sumelectthermalfe: -616.319138 hartree
dipole: 0.4509 -2.1670 0.0152
dipole: 2.2135
quadrupole: -67.2301 -86.2731 -86.2475
quadrupole: 3.5265 0.2704 -0.2389
quadrupole: 12.6868 -6.3562 -6.3306 3.5265 0.2704 -0.2389
hfenergy: -616.5265357 hartree
pointgroup: C01 [X(C12H16O2)]
dipole: -0.1733029 0.8534057 -0.0074071 debye
polarizability: 197.2968179|6.8960731|136.3422825|-0.8517101|0.0809635|76.9221105 unknown
InChI: InChI=1S/C12H16O2/c1-2-3-7-10-14-12(13)11-8-5-4-6-9-11/h4-6,8-9H,2-3,7,10H2,1H3
charge 0 multiplicity 1
30 atoms
O  -0.349485 -0.08048 0.086716
O  0.62314 -2.198304 0.082201
C  -4.176342 -0.181801 0.055764
C  -2.735696 0.380744 0.018151
C  -5.251497 0.922472 -0.062515
C  -1.692136 -0.732163 0.108025
C  -6.69017 0.364351 -0.018888
C  0.747631 -0.947127 0.077497
C  2.047012 -0.213014 0.061139
C  3.242298 -0.977712 0.031691
C  2.113447 1.20464 0.076434
C  4.494418 -0.330095 0.017032
C  3.369046 1.848232 0.06298
C  4.560039 1.083963 0.033072
H  -4.333217 -0.74329 1.000187
H  -4.313545 -0.91281 -0.768285
H  -2.587315 1.088685 0.856449
H  -2.57923 0.951079 -0.917804
H  -5.112474 1.655821 0.757821
H  -5.097091 1.480372 -1.008311
H  -1.754147 -1.436959 -0.741942
H  -1.781348 -1.315668 1.043596
H  -6.867184 -0.343465 -0.850582
H  -6.876711 -0.177587 0.927499
H  -7.439727 1.172856 -0.098372
H  3.16441 -2.069963 0.020957
H  1.185081 1.781996 0.099183
H  5.415842 -0.921859 -0.006467
H  3.421308 2.942372 0.075817
H  5.533441 1.587316 0.022454
