program: Gaussian 09
title: 000127991
version: EM64L-G09RevD.01
frameworkgroup: C1[X(C9H13NO5S)]
method: RPBEPBE
basis: SDD
operation: Freq
keyword: #p
keyword: freq=noraman
keyword: PBEPBE/SDD
title: #p freq=noraman PBEPBE/SDD
converged: YES YES NO NO
title: Mulliken charges:
elementType: S O O O O O N C C C C C C C C C H H H H H H H H H H H H H
charge: 1.100959 -0.324928 -0.477939 -0.571898 -0.505443 -0.479854 -0.292523 -0.564689 0.548583 -0.354050 -0.481239 -0.385575 0.142212 0.258051 -0.351264 -0.619289 0.233151 0.209611 0.222746 0.216241 0.266347 0.246647 0.231214 0.266425 0.231047 0.205726 0.226817 0.385858 0.417055
chargesum: 0.00000
title: Mulliken charges with hydrogens summed into heavy atoms:
elementType: S O O O O O N C C C C C C C C C
charge: 1.100959 -0.324928 -0.092081 -0.154843 -0.505443 -0.479854 -0.026097 -0.121926 0.548583 0.084938 -0.214892 -0.138928 0.142212 0.258051 -0.120050 0.044301
polarizability: 4.64384233e+02 3.15057498e+00 1.92197069e+02 -7.67532453e-01 -9.76961029e+00 1.09717205e+02
1716.lowfreq: -11.0940 -4.5670 -1.2927 -0.0013 -0.0012 0.0015 18.8979 26.2777 41.0373
frequency: 18.7660 26.2305 40.9946 65.2768 78.9040 95.5739 98.8717 113.8078 133.2640 162.6135 175.0640 218.2567 253.8671 271.3573 291.5035 305.6770 310.7754 324.3143 346.0077 370.6353 400.0494 409.3906 457.6994 465.3312 522.0374 546.1000 552.1680 580.2458 598.6467 638.7103 726.3729 742.9407 762.2365 793.6940 813.1432 835.5556 902.1623 940.2380 943.4473 946.0322 970.7555 1017.0742 1031.7850 1090.7566 1104.6692 1121.6116 1158.6384 1163.7882 1173.5308 1204.1691 1222.2008 1251.0065 1263.5320 1268.0377 1283.3483 1294.1821 1356.6435 1380.6814 1408.2341 1436.4305 1450.0393 1466.2125 1473.7259 1478.4096 1486.2545 1494.2458 1560.6824 1594.0908 2860.5845 2894.2983 2985.7786 3003.2364 3020.8139 3059.1687 3082.5931 3121.1862 3146.1830 3152.1098 3230.5157 3467.5546 3590.0975
redmass: 4.3209 7.1547 6.5092 5.8182 2.3294 3.4260 2.9327 6.3035 5.6198 7.2921 4.1176 1.4116 2.8105 9.1600 5.4478 4.6795 6.1328 4.8818 5.1795 1.1814 9.6843 3.4036 4.7874 3.5606 3.0426 2.4113 2.6426 4.0985 1.7922 2.4951 4.7218 4.4610 4.3056 1.1984 1.4655 16.7557 1.6107 4.8195 1.9379 2.5633 2.1192 2.0975 2.3647 1.6914 1.4018 1.6096 1.7172 1.3635 3.3457 1.5260 1.6474 2.0719 1.8879 1.2119 1.2942 1.7393 1.3274 4.9539 3.7249 1.1467 1.2238 1.0653 1.1664 2.4224 1.0858 1.0542 5.5770 6.5204 1.0708 1.0537 1.0659 1.0832 1.0786 1.1009 1.0995 1.0885 1.0952 1.0933 1.0676 1.0750 1.0660
irintensity: 1.0008 0.1302 3.3001 1.0935 8.7884 10.9095 26.2528 21.9211 0.4860 15.5688 12.0089 4.3671 6.6416 20.5291 0.4626 7.8055 12.2671 9.8253 63.0240 90.7552 19.3531 73.1086 2.2814 28.8768 52.5398 132.0092 206.6270 105.1866 231.0578 69.1755 4.7705 0.9561 28.4661 2.3967 39.8411 102.2875 13.2298 45.3754 5.0665 30.0894 4.0806 9.6107 1.4304 152.0668 32.0868 20.5741 25.6549 4.1597 93.6182 59.5080 93.1949 51.0237 33.8440 46.8845 26.8397 54.6817 15.4581 8.9436 90.5139 33.4337 15.9268 26.0271 6.5395 45.2450 5.7697 32.5191 35.9360 32.1313 24.1610 211.5525 22.5940 30.6891 70.5063 19.6289 35.6554 9.8280 10.8717 3.0273 105.5280 34.1279 94.9762
temp: 298.150 k
press: 1.00000 atm
elementType: 16 8 8 8 8 8 7 6 6 6 6 6 6 6 6 6 1 1 1 1 1 1 1 1 1 1 1 1 1
symmnumber: 1
zpe: 562824.0 jmol-1
zpe.correction: 0.214368 hartree
zpe.thermalcorrener: 0.232609 hartree
zpe.thermalcorrenthalpy: 0.233554 hartree
zpe.thermalcorrgfe: 0.165760 hartree
zpe.sumelectzpe: -1178.250564 hartree
zpe.sumelectthermal: -1178.232323 hartree
zpe.sumelectthermalent: -1178.231379 hartree
zpe.sumelectthermalfe: -1178.299172 hartree
dipole: 7.3018 5.7123 -1.1033
dipole: 9.3362
quadrupole: -110.4646 -93.5315 -102.7012
quadrupole: -23.1118 6.5102 -9.8208
quadrupole: -8.2321 8.7009 -0.4688 -23.1118 6.5102 -9.8208
hfenergy: -1178.4649321 hartree
pointgroup: C01 [X(C9H13N1O5S1)]
dipole: 2.682356 -2.4984471 0.2337622 debye
polarizability: 462.0731241|-24.1680232|195.4733803|7.8862993|-0.7838854|108.7520033 unknown
InChI: InChI=1S/C9H12NO2.HO3S/c1-10-5-4-7-2-3-8(11)9(12)6-7;1-4(2)3/h2-3,6,10-11H,4-5H2,1H3;1H
charge 0 multiplicity 1
29 atoms
S  -2.927824 1.809228 0.118568
O  -1.980971 0.559469 -1.410811
O  -2.699914 -1.602706 0.138007
O  -4.362826 0.689611 0.253707
O  -1.993357 1.663212 1.439648
O  -3.532238 3.246622 -0.28488
N  4.796935 0.826131 0.038409
C  2.860315 -0.439376 -0.87552
C  1.396282 -0.78267 -0.666433
C  3.372545 0.525288 0.227619
C  0.375377 0.075842 -1.114692
C  1.024245 -1.951568 0.059791
C  -1.006982 -0.212697 -0.887255
C  -1.33738 -1.390932 -0.118466
C  -0.327524 -2.257493 0.335807
C  5.443542 1.598171 1.112372
H  3.490749 -1.346532 -0.858955
H  3.0028 0.040894 -1.863918
H  3.248899 0.046444 1.219501
H  2.722846 1.437042 0.237908
H  0.604148 0.984197 -1.683238
H  1.807338 -2.62825 0.421009
H  -0.580496 -3.159515 0.90687
H  5.008026 1.181939 -0.901951
H  5.400893 1.024868 2.056814
H  4.975769 2.593447 1.302651
H  6.507658 1.758625 0.866533
H  -2.850692 -2.403862 0.697904
H  -3.960563 -0.228032 0.094397
