program: Gaussian 09
title: 000128488
version: EM64L-G09RevD.01
frameworkgroup: C1[X(C15H20N4O3S)]
method: RPBEPBE
basis: SDD
operation: Freq
keyword: #p
keyword: freq=noraman
keyword: PBEPBE/SDD
title: #p freq=noraman PBEPBE/SDD
converged: NO YES NO NO
title: Mulliken charges:
elementType: S O O O N N N N C C C C C C C C C C C C C C C H H H H H H H H H H H H H H H H H H H H
charge: 0.209904 -0.404781 -0.355103 -0.289049 -0.080718 -0.058337 -0.002943 -0.038660 -0.321438 -0.492864 -0.595322 -0.634777 -0.605653 -0.464203 -0.839984 0.108557 0.203969 0.346014 -0.329084 -0.336887 -0.334496 -0.359878 0.272304 0.323280 0.244241 0.319159 0.365030 0.230676 0.217783 0.223914 0.272047 0.355506 0.316634 0.240069 0.238093 0.222629 0.236694 0.280032 0.275024 0.254184 0.278773 0.248229 0.261432
chargesum: 0.00000
title: Mulliken charges with hydrogens summed into heavy atoms:
elementType: S O O O N N N N C C C C C C C C C C C C C C C
charge: 0.209904 -0.404781 -0.355103 -0.289049 -0.080718 -0.058337 -0.002943 -0.038660 0.246082 -0.173705 0.218166 0.216690 0.189142 -0.004880 -0.284928 0.108557 0.203969 0.346014 -0.074900 -0.058114 -0.086267 -0.098446 0.272304
polarizability: 4.80501806e+02 -8.31450006e-01 2.08064742e+02 -2.19697677e+01 5.41651163e+00 1.92160521e+02
1716.lowfreq: -11.5969 -6.4934 -0.0023 -0.0023 -0.0021 5.8647 13.2471 24.9505 33.9268
frequency: 12.9137 23.7297 33.8897 50.5124 55.6638 67.4027 77.8001 101.7272 112.2752 119.7716 127.7600 133.6102 174.3665 194.1697 212.3015 215.3541 235.9896 269.2748 286.5973 295.8545 321.6514 335.1836 341.1376 346.5161 368.1200 380.1855 382.8905 408.2504 430.6366 440.5011 447.0495 452.4735 461.1559 486.6709 502.5846 521.7710 552.3789 594.8150 617.9196 630.7611 648.9406 691.9131 701.7874 719.7298 744.6541 766.2095 794.6337 826.5083 832.8549 850.0662 864.6977 880.0142 907.6884 912.5007 931.6328 955.8833 960.4282 997.9286 999.7281 1022.7278 1023.9989 1065.6964 1073.1662 1096.1635 1109.4507 1119.7897 1124.2947 1127.0387 1142.5975 1192.2715 1203.2717 1207.0840 1216.6569 1226.9921 1237.9971 1254.1645 1255.8210 1284.2649 1296.0247 1302.9358 1325.0978 1330.6068 1371.0311 1403.9584 1419.7321 1428.5933 1430.6016 1437.3592 1446.0391 1450.6574 1452.4260 1468.0894 1477.3934 1488.1345 1493.6785 1496.0360 1500.7070 1514.0366 1520.4560 1538.4205 1569.7728 1610.8779 2045.9312 2920.6728 2972.1187 2996.4886 3005.3394 3018.0561 3039.7328 3072.5714 3076.0366 3092.1590 3100.1670 3104.7258 3114.6790 3114.9125 3119.7735 3125.4950 3131.2803 3138.5919 3158.8025 3165.6602 3178.8691
redmass: 9.7144 4.7034 5.6679 6.4561 5.0965 6.5302 6.2430 7.2730 4.2341 5.4678 5.2204 9.0879 6.0569 6.7735 6.1266 4.6083 4.2891 1.1024 6.1915 4.4693 5.3373 3.3090 1.1083 1.0911 2.4467 2.6143 6.0846 2.9045 2.3902 2.4172 2.8158 2.7944 12.3219 4.4317 2.6078 4.7120 6.6042 7.2003 5.8234 6.4369 5.4016 5.7032 3.9246 4.3108 5.3865 3.9404 6.5910 1.3756 3.2641 4.9976 1.5735 2.7067 2.4161 2.1369 2.5282 2.4921 1.3943 1.3694 3.5328 1.7909 2.4307 1.2274 3.1088 4.1582 1.2456 1.3834 1.3100 1.3711 1.3339 1.1625 1.2245 1.2076 1.5107 4.6660 1.6455 1.6490 1.5208 1.3097 3.2753 1.3573 1.2120 5.3224 5.0497 1.1714 1.1085 1.5420 2.1830 1.1756 1.1557 1.1016 1.0872 1.1438 1.0531 1.1009 1.0569 2.5027 1.1725 3.6900 1.0604 4.0554 7.5004 6.2103 13.9634 1.0502 1.0405 1.0331 1.0641 1.0592 1.0578 1.0890 1.0850 1.1009 1.1031 1.1037 1.1059 1.1065 1.1047 1.1038 1.1038 1.0892 1.0884 1.0955 1.0976
irintensity: 1.8582 6.6846 0.4093 2.1068 0.8716 2.1320 0.8842 6.4975 0.0159 2.0056 2.4228 2.1352 21.6756 23.6585 6.2333 2.5191 4.9883 0.5948 4.2414 5.0863 3.2132 0.6983 0.0385 0.5785 2.4664 1.3806 4.9147 0.6421 3.6961 8.5698 3.8221 3.4981 0.5645 36.3985 1.3010 38.7254 1.1633 24.8485 4.8102 3.4516 1.6778 12.9178 8.7712 1.2252 1.3561 15.0681 0.9955 11.8076 27.5038 33.3381 48.7813 2.0026 7.9087 13.6499 17.3679 13.2510 0.3431 0.3031 14.5790 5.0255 36.2126 0.2714 14.8758 26.9384 2.2788 4.4379 25.7002 21.4690 6.0287 96.1814 23.0042 11.3562 7.0663 393.1359 1.4160 7.3235 9.7728 23.0149 173.8737 14.3425 1.0790 232.1350 17.7159 79.1893 24.2358 10.9093 10.3725 60.1884 103.3685 81.0549 5.6619 65.1408 10.6516 16.5054 9.0134 50.3224 49.3272 71.5692 69.6485 462.2842 51.5279 196.7743 849.4287 138.2981 84.9640 56.6921 36.3176 14.0139 18.5788 2.6019 2.3447 5.4200 4.4978 7.8729 15.2065 1.4816 2.6729 20.9602 17.2026 6.4142 0.5456 4.6894 4.7511
temp: 298.150 k
press: 1.00000 atm
elementType: 16 8 8 8 7 7 7 7 6 6 6 6 6 6 6 6 6 6 6 6 6 6 6 1 1 1 1 1 1 1 1 1 1 1 1 1 1 1 1 1 1 1 1
symmnumber: 1
zpe: 886789.3 jmol-1
zpe.correction: 0.337760 hartree
zpe.thermalcorrener: 0.361450 hartree
zpe.thermalcorrenthalpy: 0.362394 hartree
zpe.thermalcorrgfe: 0.282460 hartree
zpe.sumelectzpe: -1424.495699 hartree
zpe.sumelectthermal: -1424.472009 hartree
zpe.sumelectthermalent: -1424.471065 hartree
zpe.sumelectthermalfe: -1424.550999 hartree
dipole: -2.3999 -9.8623 3.8654
dipole: 10.8612
quadrupole: -156.9262 -155.7574 -145.2660
quadrupole: -36.8970 7.8181 10.9775
quadrupole: -4.2763 -3.1075 7.3838 -36.8970 7.8181 10.9775
hfenergy: -1424.8334593 hartree
pointgroup: C01 [X(C15H20N4O3S1)]
dipole: 2.4546124 -3.1633175 -1.4926645 debye
polarizability: 437.9884259|100.2914516|251.8327892|-8.174876|-9.3520565|190.9058543 unknown
InChI: InChI=1S/C15H20N4O3S/c1-19(2,3)9-13(8-15(21)22)23-10-14(20)11-4-6-12(7-5-11)17-18-16/h4-7,13H,8-10H2,1-3H3
charge 0 multiplicity 1
43 atoms
S  -0.750221 0.642144 -1.957211
O  -5.000986 0.210764 0.202569
O  -3.722511 1.128043 1.935474
O  0.740155 -1.696816 0.302191
N  -2.838064 -2.258961 0.270192
N  5.393288 2.633269 1.384339
N  5.855388 3.632748 0.754414
N  6.42268 4.589672 0.345766
C  -2.659686 -1.185243 -0.882035
C  -1.931979 0.137278 -0.526776
C  -4.316368 -2.665214 0.307316
C  -2.433713 -1.775996 1.668927
C  -1.981876 -3.478131 -0.058909
C  -2.912758 1.324502 -0.356043
C  0.597635 -0.720769 -1.89025
C  -3.998376 0.891499 0.69421
C  1.203651 -0.815337 -0.503372
C  2.281071 0.116719 -0.074699
C  2.723551 1.207527 -0.874993
C  2.892667 -0.092647 1.195703
C  3.745396 2.061135 -0.428876
C  3.917407 0.747173 1.650751
C  4.348819 1.829992 0.838865
H  -3.68734 -0.920661 -1.188426
H  -2.14295 -1.723149 -1.691167
H  -1.299942 0.049415 0.369748
H  -4.908206 -1.748921 0.507878
H  -4.587503 -3.083687 -0.675809
H  -4.448744 -3.426719 1.09324
H  -2.719867 -2.571406 2.376957
H  -1.342573 -1.637636 1.69289
H  -2.958623 -0.839651 1.926312
H  -0.926793 -3.160304 -0.090372
H  -2.126718 -4.233994 0.72996
H  -2.302379 -3.891427 -1.028409
H  -3.403966 1.553594 -1.319184
H  -2.361253 2.206504 0.008314
H  1.312225 -0.422262 -2.673326
H  0.141765 -1.687082 -2.157402
H  2.249814 1.414681 -1.839179
H  2.540774 -0.929267 1.806904
H  4.067484 2.904803 -1.049673
H  4.394625 0.591915 2.622492
