program: Gaussian 09
title: 000127066
version: EM64L-G09RevD.01
frameworkgroup: C1[X(C11H23N3O)]
method: RPBEPBE
basis: SDD
operation: Freq
keyword: #p
keyword: freq=noraman
keyword: PBEPBE/SDD
title: #p freq=noraman PBEPBE/SDD
converged: YES YES NO NO
title: Mulliken charges:
elementType: O N N N C C C C C C C C C C C H H H H H H H H H H H H H H H H H H H H H H H
charge: -0.297136 -0.072526 -0.154057 -0.181883 -0.344020 -0.357526 -0.374907 -0.426194 -0.292383 0.258247 -0.702403 -0.363165 -0.330649 -0.662145 -0.659165 0.211225 0.179069 0.179801 0.210484 0.244500 0.216721 0.232997 0.233088 0.175382 0.204085 0.229812 0.216466 0.213420 0.208161 0.236131 0.195997 0.267589 0.216579 0.232058 0.212517 0.203787 0.226171 0.213874
chargesum: 0.00000
title: Mulliken charges with hydrogens summed into heavy atoms:
elementType: O N N N C C C C C C C C C C C
charge: -0.297136 -0.072526 -0.154057 -0.181883 0.046274 0.032760 0.086313 0.039892 0.087084 0.258247 -0.042705 0.081127 0.132937 -0.000992 -0.015333
polarizability: 1.82963675e+02 1.47561979e+00 1.32646799e+02 -1.62527403e+00 -3.70289282e+00 1.19868985e+02
1716.lowfreq: -18.1884 -8.3790 -3.1994 0.0003 0.0004 0.0005 29.5941 46.5982 53.4875
frequency: 28.5965 46.5356 53.3417 59.4860 62.3065 86.6300 123.5996 134.0970 169.3861 202.7437 216.1546 233.7031 241.0117 287.5325 290.0422 299.6362 312.8669 332.3893 374.9457 401.2794 432.7758 465.8455 480.5443 518.6081 541.3767 611.1990 698.3505 725.5882 727.8554 774.3797 782.1422 798.8674 838.4629 842.5875 931.2204 932.6534 943.0323 971.9855 1019.6763 1033.0036 1051.0254 1066.7086 1072.3636 1078.1733 1079.8880 1091.3492 1099.4535 1119.4007 1143.8797 1156.0006 1182.2648 1191.7737 1199.7076 1215.1121 1242.3231 1256.4046 1278.6468 1290.0038 1296.8608 1324.6332 1333.5414 1338.3052 1341.3071 1358.2423 1359.8540 1367.0192 1383.7587 1384.3163 1384.8991 1389.6313 1407.0268 1449.4702 1458.6968 1464.7823 1465.4218 1468.5282 1469.1941 1469.8225 1474.9479 1477.3012 1479.2057 1483.3771 1490.1344 1491.3820 1567.4316 2825.9484 2838.0466 2852.4702 2944.0992 2960.0208 2976.4652 2978.7316 2983.7755 2987.8802 3004.5342 3009.6038 3024.9409 3052.6760 3061.2937 3073.2204 3080.5390 3081.3290 3081.4950 3091.0268 3092.0410 3092.3804 3094.1897 3101.2333
redmass: 3.1694 2.3814 2.6724 2.2548 3.7668 4.3250 2.4733 2.4344 2.0885 1.1170 1.4351 1.7350 1.7444 2.4318 2.7417 2.4275 2.3707 2.6411 2.7924 1.9156 2.9722 2.7510 3.1826 3.2884 3.0808 2.7795 3.4171 4.6457 4.0430 1.2341 1.2294 1.1413 1.5565 2.5305 2.0219 2.1758 2.0262 2.4192 2.3371 2.1582 1.7632 2.1676 2.0807 2.1673 2.1075 2.0078 1.7838 2.1315 2.4572 2.8199 1.8374 1.2210 2.6221 3.0581 1.5628 1.4173 1.2788 1.2462 1.3579 1.2741 1.3664 1.2896 1.2455 1.3766 1.4890 1.5123 1.2156 1.2651 1.2220 1.3999 2.3645 1.0829 1.0894 1.0755 1.0698 1.0458 1.0505 1.0548 1.0659 1.0503 1.0986 1.0981 1.1039 1.0707 7.9079 1.0704 1.0717 1.0695 1.0707 1.0690 1.0562 1.0456 1.0372 1.0356 1.0666 1.0875 1.0882 1.0884 1.0971 1.0975 1.0956 1.0982 1.0974 1.0926 1.1003 1.1003 1.0923 1.0991
irintensity: 0.1131 0.2304 0.0661 0.2452 1.4324 2.7857 3.9345 0.5014 3.9157 0.6861 1.0502 6.5305 1.5896 0.5864 1.3516 4.2236 0.6571 13.6757 9.2776 3.9143 0.2202 0.0984 6.8838 4.4005 5.6527 7.7191 0.0217 16.3469 0.4158 12.1477 10.1988 3.5693 0.9763 0.9229 5.2236 4.3962 3.4879 48.2234 12.0376 37.6160 3.6931 18.3924 1.2005 4.5326 39.5306 8.8886 15.2892 53.2102 32.2962 38.0362 43.3402 16.8927 37.6744 1.0509 207.2571 24.3907 35.4209 12.1788 24.9582 15.5082 3.8051 15.1057 2.1382 28.6256 9.3478 10.0447 1.6634 14.3270 40.0910 25.7365 300.6974 4.9265 14.5849 8.9517 5.1482 13.3262 9.6774 1.8133 7.4514 1.6134 16.5100 27.2896 57.3681 8.2252 259.0803 53.1377 64.2137 184.2860 51.3423 63.7957 34.0919 35.8309 38.8106 27.7234 38.0170 19.2647 55.7306 44.8855 15.9563 4.1477 49.9028 25.0907 56.9704 10.2868 25.5274 41.0967 41.1667 36.7715
temp: 298.150 k
press: 1.00000 atm
elementType: 8 7 7 7 6 6 6 6 6 6 6 6 6 6 6 1 1 1 1 1 1 1 1 1 1 1 1 1 1 1 1 1 1 1 1 1 1 1
symmnumber: 1
zpe: 882293.5 jmol-1
zpe.correction: 0.336048 hartree
zpe.thermalcorrener: 0.353451 hartree
zpe.thermalcorrenthalpy: 0.354395 hartree
zpe.thermalcorrgfe: 0.289957 hartree
zpe.sumelectzpe: -671.206351 hartree
zpe.sumelectthermal: -671.188947 hartree
zpe.sumelectthermalent: -671.188003 hartree
zpe.sumelectthermalfe: -671.252441 hartree
dipole: -1.0641 3.9827 -0.6252
dipole: 4.1695
quadrupole: -86.4530 -98.8588 -93.4832
quadrupole: 5.6308 -3.2176 1.1748
quadrupole: 6.4787 -5.9272 -0.5515 5.6308 -3.2176 1.1748
hfenergy: -671.5423985 hartree
pointgroup: C01 [X(C11H23N3O1)]
dipole: 0.4519413 -1.4478738 -0.6247771 debye
polarizability: 182.8324872|1.6910153|130.0706096|2.9642247|6.409961|122.5763616 unknown
InChI: InChI=1S/C11H23N3O/c1-4-12-7-9-14(10-8-12)11(15)13(5-2)6-3/h4-10H2,1-3H3
charge 0 multiplicity 1
38 atoms
O  -1.690144 1.771062 1.163869
N  2.796333 -0.008273 -0.336429
N  0.002586 0.496547 0.162317
N  -2.28393 -0.158557 -0.054887
C  2.313033 0.399704 1.008747
C  1.742423 -0.757369 -1.065381
C  1.036064 1.252245 0.901055
C  0.470526 0.099293 -1.185709
C  4.07881 -0.757034 -0.300553
C  -1.348311 0.763516 0.461505
C  5.269346 0.095962 0.175083
C  -2.022847 -1.621029 -0.052451
C  -3.710781 0.24788 -0.060394
C  -2.230779 -2.269024 1.337323
C  -4.300956 0.284416 -1.485326
H  3.096038 0.998323 1.505823
H  2.1002 -0.494294 1.651031
H  1.485884 -1.721293 -0.550561
H  2.120024 -1.001139 -2.07651
H  0.64232 1.505753 1.898186
H  1.26947 2.203336 0.377051
H  0.717783 1.013313 -1.769184
H  -0.324385 -0.4388 -1.723967
H  3.998644 -1.676558 0.337201
H  4.28012 -1.10346 -1.332901
H  5.334058 1.023403 -0.420551
H  5.188506 0.373248 1.241122
H  6.212362 -0.467399 0.051963
H  -2.697359 -2.088029 -0.795447
H  -0.991211 -1.821143 -0.381822
H  -4.298037 -0.44495 0.575798
H  -3.766366 1.242013 0.413121
H  -3.258517 -2.113564 1.71039
H  -1.529217 -1.835289 2.071663
H  -2.048809 -3.358828 1.284013
H  -4.23186 -0.700984 -1.983087
H  -3.762935 1.021176 -2.107233
H  -5.368587 0.571626 -1.451267
