program: Gaussian 09
title: 000126801
version: EM64L-G09RevD.01
frameworkgroup: C1[X(C10H15N2)]
method: RPBEPBE
basis: SDD
operation: Freq
keyword: #p
keyword: freq=noraman
keyword: PBEPBE/SDD
title: #p freq=noraman PBEPBE/SDD
converged: YES YES NO NO
title: Mulliken charges:
elementType: N N C C C C C C C C C C H H H H H H H H H H H H H H H
charge: -0.262855 -0.053129 -0.238517 -0.469008 -0.423481 -0.474749 0.408166 -0.307368 -0.254105 -0.151531 -0.169522 -0.586850 0.264112 0.234771 0.212955 0.240547 0.245853 0.253704 0.249636 0.257135 0.303641 0.327797 0.279908 0.287831 0.285281 0.283168 0.256610
chargesum: 1.00000
title: Mulliken charges with hydrogens summed into heavy atoms:
elementType: N N C C C C C C C C C C
charge: -0.005719 -0.053129 0.025594 -0.021282 0.062920 0.028591 0.408166 -0.003727 0.073692 0.128377 0.118308 0.238209
polarizability: 1.66218428e+02 5.57664414e-01 1.17696646e+02 -3.33570198e+00 5.04747438e-01 7.18537053e+01
1716.lowfreq: -8.1379 -0.0006 -0.0006 -0.0006 6.4763 9.3395 29.6764 39.7182 85.2766
frequency: 29.4596 39.7080 85.1229 118.4539 126.3615 194.5360 230.0029 289.8044 333.4171 412.1425 433.0005 462.1332 528.6610 567.5662 656.6721 660.6836 686.3353 750.4259 774.4285 796.2794 820.4790 861.8406 887.4717 904.6265 936.3585 953.1313 969.4780 999.5775 1011.1939 1017.4470 1019.5157 1058.9074 1064.1502 1081.5572 1124.2698 1130.8719 1164.4753 1179.4297 1193.7880 1206.6743 1233.5107 1246.9249 1262.0770 1293.8539 1295.6203 1325.5085 1327.8953 1341.5778 1366.3397 1420.9968 1429.2113 1447.1639 1467.5307 1469.2043 1476.6991 1479.6403 1487.3319 1497.8717 1573.8056 1618.8134 2948.0799 2985.0613 3023.4751 3025.2695 3033.8350 3060.7966 3088.4459 3109.4795 3129.0953 3150.3855 3172.2405 3189.5005 3190.3622 3207.6789 3376.4866
redmass: 2.8480 1.0466 2.5545 3.5159 2.1419 2.9023 2.8283 4.2634 3.7643 2.7699 3.1082 2.8803 5.4348 2.8348 3.5832 4.1506 2.1948 3.0407 1.9456 1.4164 1.5092 1.9585 3.1193 1.4847 2.2941 1.3617 2.7322 1.6476 2.1446 1.7173 4.4283 2.3137 2.0090 2.8480 1.3629 1.4030 1.9269 1.2486 1.3339 1.2668 1.2002 2.1444 1.2632 1.2632 1.2430 1.2843 1.4554 1.6388 3.6993 1.4858 1.1440 1.5065 1.0894 1.0403 1.0813 1.3346 1.0917 1.9801 5.3708 5.0128 1.0819 1.0626 1.0623 1.0337 1.0643 1.1007 1.1040 1.1053 1.1043 1.1035 1.0925 1.0932 1.0950 1.1009 1.0747
irintensity: 0.5742 0.3933 0.8263 0.8335 2.5611 1.4425 5.3831 4.5415 0.9166 0.9531 2.6635 5.8244 1.0141 1.2572 5.3236 0.4124 30.3646 25.5431 83.3687 11.6779 35.3969 8.4041 6.2913 7.0061 18.4705 1.1550 0.4595 1.7686 0.2448 0.4723 10.6432 4.8699 18.6889 10.1825 2.0416 9.1678 22.6056 2.3910 3.4090 8.1190 4.1238 16.9165 2.7479 3.4697 6.8544 3.7898 0.0540 1.3397 3.4455 19.4053 11.8123 5.1448 3.6559 26.4928 8.1375 4.6526 4.6604 104.1863 1.2522 18.0232 12.6940 25.6557 24.1348 2.3417 38.9730 18.0781 9.0524 30.5131 1.4736 1.8213 1.8436 1.1321 2.4407 1.2990 0.9011
temp: 298.150 k
press: 1.00000 atm
elementType: 7 7 6 6 6 6 6 6 6 6 6 6 1 1 1 1 1 1 1 1 1 1 1 1 1 1 1
symmnumber: 1
zpe: 619140.5 jmol-1
zpe.correction: 0.235818 hartree
zpe.thermalcorrener: 0.247163 hartree
zpe.thermalcorrenthalpy: 0.248107 hartree
zpe.thermalcorrgfe: 0.197042 hartree
zpe.sumelectzpe: -498.411823 hartree
zpe.sumelectthermal: -498.400478 hartree
zpe.sumelectthermalent: -498.399534 hartree
zpe.sumelectthermalfe: -498.450599 hartree
dipole: -6.7755 -1.7517 0.4547
dipole: 7.0130
quadrupole: -27.0795 -56.8776 -68.3811
quadrupole: 0.6296 -0.9975 -0.1636
quadrupole: 23.6999 -6.0982 -17.6017 0.6296 -0.9975 -0.1636
hfenergy: -498.6476409 hartree
pointgroup: C01 [X(C10H15N2)]
dipole: -2.5796884 0.9550145 0.2145494 debye
polarizability: 165.3310912|-7.6664637|107.8055719|3.2630999|19.2883886|82.6321157 unknown
InChI: InChI=1S/C10H15N2/c1-12-7-3-4-9(8-12)10-5-2-6-11-10/h3-4,7-8,10-11H,2,5-6H2,1H3
charge 1 multiplicity 1
27 atoms
N  2.044685 -0.849362 -0.861664
N  -2.32997 0.8230 0.245009
C  1.317708 -0.333178 0.343193
C  2.059692 0.974798 0.754252
C  3.548902 0.657685 0.393954
C  3.486199 -0.631031 -0.510614
C  -0.174188 -0.279643 0.083181
C  -0.969462 0.807854 0.47951
C  -0.8131 -1.371403 -0.572305
C  -2.20161 -1.334471 -0.813036
C  -2.9497 -0.222936 -0.393629
C  -3.123026 2.006916 0.703798
H  1.483559 -1.084119 1.146584
H  1.935987 1.22894 1.821924
H  1.690888 1.826042 0.148078
H  4.014555 1.505901 -0.134659
H  4.14763 0.467367 1.300728
H  4.085443 -0.544679 -1.430576
H  3.847409 -1.512534 0.046978
H  1.79512 -0.282127 -1.69039
H  -0.55708 1.679774 0.991649
H  -0.1994 -2.221265 -0.886622
H  -2.714945 -2.157219 -1.315753
H  -4.027458 -0.143006 -0.547322
H  -3.050075 2.097318 1.799188
H  -2.732884 2.919759 0.226693
H  -4.177179 1.875819 0.421949
