program: Gaussian 09
title: 000128004
version: EM64L-G09RevD.01
frameworkgroup: C1[X(C12H21FO10)]
method: RPBEPBE
basis: SDD
operation: Freq
keyword: #p
keyword: freq=noraman
keyword: PBEPBE/SDD
title: #p freq=noraman PBEPBE/SDD
converged: YES YES NO NO
title: Mulliken charges:
elementType: F O O O O O O O O O O C C C C C C C C C C C C H H H H H H H H H H H H H H H H H H H H H
charge: -0.221557 -0.352818 -0.383518 -0.241955 -0.450695 -0.429620 -0.431980 -0.437583 -0.399416 -0.454178 -0.470365 0.265631 -0.186497 -0.141280 -0.145315 0.008986 -0.145033 -0.075521 -0.113130 -0.104916 -0.359763 -0.350395 -0.355638 0.289216 0.291392 0.280039 0.212993 0.228276 0.276303 0.206885 0.289629 0.200965 0.233137 0.233039 0.225704 0.179003 0.264354 0.375952 0.345436 0.358272 0.363221 0.346984 0.370389 0.405366
chargesum: 0.00000
title: Mulliken charges with hydrogens summed into heavy atoms:
elementType: F O O O O O O O O O O C C C C C C C C C C C C
charge: -0.221557 -0.352818 -0.383518 -0.241955 -0.074742 -0.084184 -0.073708 -0.074362 -0.052432 -0.083790 -0.064999 0.265631 0.102719 0.150113 0.134724 0.221979 0.083244 0.200782 0.093755 0.184713 0.074339 0.108348 0.087719
polarizability: 1.89240835e+02 -3.90491880e+00 1.59052825e+02 -2.27745037e+00 -2.76897087e-01 1.34943825e+02
1716.lowfreq: -10.3769 0.0007 0.0008 0.0009 6.8156 11.1317 35.8051 36.5971 61.5186
frequency: 35.7050 36.5496 61.5096 71.4245 80.7961 90.9495 104.9022 108.4760 139.0520 147.4044 167.6115 181.9698 186.2660 200.4777 209.3970 218.2846 231.2042 236.9975 255.1388 272.8892 280.1141 293.1715 302.0198 327.7718 333.9637 349.5402 358.5375 371.5554 382.4407 406.1877 415.0739 416.5079 426.8971 463.4333 487.3654 504.2991 520.6637 549.6759 551.4094 586.4800 617.9072 673.0566 684.9488 716.4260 730.9124 747.7934 782.8303 792.4111 828.2506 847.8297 879.5812 911.8394 926.8976 929.7399 960.2692 968.1479 976.4600 980.5718 991.1508 995.0797 1010.0243 1020.7184 1023.9358 1038.6128 1044.2544 1048.9716 1051.8714 1067.6828 1078.0322 1083.7073 1087.1538 1125.7118 1133.0811 1181.4492 1188.0878 1195.8871 1199.0689 1213.2314 1221.6084 1235.7810 1249.9258 1260.7122 1270.5623 1279.7431 1285.9030 1298.7894 1299.4089 1305.5183 1313.6304 1319.1087 1323.2464 1344.4419 1354.0883 1359.2221 1359.9767 1360.6979 1369.6754 1371.1188 1375.3097 1382.8715 1396.5966 1441.3943 1460.0771 1466.0449 1474.5295 2920.3684 2931.3741 2949.6384 2959.1963 2965.2271 3005.1901 3049.1497 3056.7192 3074.4069 3082.5144 3085.9691 3086.4893 3097.7666 3112.3542 3254.7853 3313.0074 3481.6351 3550.4005 3551.4121 3552.2300 3552.9048
redmass: 7.5413 6.7465 7.1218 8.1241 7.1808 5.4920 6.4329 5.0822 4.3899 5.3639 5.3480 3.8501 3.8304 3.1534 3.4913 3.0973 3.6882 4.3287 5.1822 1.7912 2.3999 2.6176 2.9863 4.1593 2.3135 2.9474 2.5133 5.0335 3.4605 2.4743 1.1946 2.8061 5.1968 1.8555 3.9928 4.4581 3.4248 4.0393 4.2421 4.0377 4.1116 3.2461 1.2991 1.2634 3.5222 5.2115 3.7727 4.4745 3.8227 2.9671 3.0884 5.6363 3.6549 3.6398 3.2183 4.0934 4.1792 3.5711 4.7215 3.1409 4.1580 4.9206 3.9202 4.3356 3.0504 3.7281 3.0457 2.3088 2.4753 3.7147 4.3378 2.9735 1.6819 1.1674 1.2834 1.1885 1.3575 1.5755 1.3258 1.2236 1.1749 1.4556 1.2325 1.3157 1.2202 1.2668 1.2555 1.2852 1.2893 1.2826 1.3246 1.2401 1.2714 1.2386 1.3550 1.3289 1.3768 1.2555 1.2540 1.5402 1.1469 1.0774 1.0874 1.1072 1.0822 1.0818 1.0819 1.0713 1.0696 1.0839 1.0602 1.0865 1.0880 1.1028 1.0901 1.0868 1.0931 1.0910 1.0883 1.0708 1.0679 1.0648 1.0654 1.0663 1.0659 1.0655
irintensity: 0.7202 0.6546 1.5347 0.6053 7.9284 4.3322 3.8923 0.8335 3.9943 19.3993 3.7504 6.0713 1.8070 3.4352 25.9741 40.4543 13.8903 20.9733 28.0479 32.3488 54.1120 9.1042 78.6859 55.2070 120.1847 11.7497 32.0705 22.4973 30.4894 2.0841 150.8877 28.6476 1.6772 44.0104 11.9088 24.1158 3.1207 9.1557 6.8709 18.6275 0.4338 49.3877 183.8530 8.6734 3.2000 87.4772 8.7366 34.9766 32.3280 95.1562 38.0852 204.5050 18.9199 92.8743 7.6326 68.4120 128.8511 88.4414 207.8034 48.1242 61.9530 31.0907 69.3889 49.8398 13.8234 40.0882 31.8210 38.6498 2.9130 72.0517 32.6694 4.8250 15.2220 28.0196 26.1768 27.2513 20.4793 32.3610 37.7117 7.8987 37.3677 28.7114 10.5110 8.6822 23.3666 12.8523 9.0012 2.9846 6.2277 8.4429 28.2301 7.5768 14.5900 30.2970 13.1020 18.0091 5.9585 19.8524 10.5746 5.0506 42.4626 10.4011 17.3338 62.2727 8.4951 4.0210 22.6693 65.8157 44.6769 83.0100 24.4369 12.3604 7.2272 32.7775 8.9091 4.5355 17.4709 16.7550 5.6585 169.8166 567.1892 85.6913 6.0633 7.3925 19.0808 11.0873
temp: 298.150 k
press: 1.00000 atm
elementType: 9 8 8 8 8 8 8 8 8 8 8 6 6 6 6 6 6 6 6 6 6 6 6 1 1 1 1 1 1 1 1 1 1 1 1 1 1 1 1 1 1 1 1 1
symmnumber: 1
zpe: 902644.8 jmol-1
zpe.correction: 0.343799 hartree
zpe.thermalcorrener: 0.367866 hartree
zpe.thermalcorrenthalpy: 0.368811 hartree
zpe.thermalcorrgfe: 0.291767 hartree
zpe.sumelectzpe: -1320.012643 hartree
zpe.sumelectthermal: -1319.988576 hartree
zpe.sumelectthermalent: -1319.987631 hartree
zpe.sumelectthermalfe: -1320.064675 hartree
dipole: -2.5378 -2.0080 4.2883
dipole: 5.3723
quadrupole: -147.5933 -159.5045 -138.1811
quadrupole: -1.7749 -3.0762 1.4777
quadrupole: 0.8330 -11.0782 10.2452 -1.7749 -3.0762 1.4777
hfenergy: -1320.3564419 hartree
pointgroup: C01 [X(C12H21F1O10)]
dipole: -1.0489524 -0.0639109 1.8338785 debye
polarizability: 189.7147094|0.3653386|153.2779324|2.3659511|-9.8711802|140.2448431 unknown
InChI: InChI=1S/C12H21FO10/c13-6-7(17)4(1-14)21-11(9(6)19)23-12(3-16)10(20)8(18)5(2-15)22-12/h4-11,14-20H,1-3H2
charge 0 multiplicity 1
44 atoms
F  -4.333026 -2.026905 0.510876
O  1.497095 0.996358 0.497998
O  0.466633 -1.25632 0.441661
O  -1.041629 0.111126 -0.712029
O  2.453118 -1.711432 -1.145368
O  4.581969 0.789623 0.540342
O  -1.445561 -3.015207 -0.206733
O  -4.627317 0.517264 -0.821691
O  1.854279 -1.879112 2.844501
O  1.04258 2.60446 -2.263213
O  -0.615754 2.737715 -0.021144
C  1.642593 -0.409635 0.8518
C  2.858442 -0.960148 0.035092
C  3.589251 0.325814 -0.437182
C  2.45679 1.347836 -0.651065
C  -0.851669 -0.680082 0.498956
C  -1.887628 -1.84571 0.540586
C  -3.185548 -1.372938 -0.139267
C  -3.452091 0.138852 -0.040021
C  -2.262765 0.955912 -0.612452
C  1.771308 -0.499918 2.383555
C  1.746096 1.353657 -2.018667
C  -1.960971 2.2304 0.223932
H  3.510931 -1.579295 0.674507
H  4.158886 0.108901 -1.351596
H  2.785844 2.377611 -0.42444
H  -0.959936 -0.034164 1.400216
H  -2.097087 -2.104394 1.601298
H  -3.185572 -1.705762 -1.191075
H  -3.618991 0.380536 1.035216
H  -2.486317 1.216549 -1.658254
H  0.928832 0.050033 2.856249
H  2.71552 -0.028613 2.70142
H  1.082492 0.473023 -2.10955
H  2.51801 1.296279 -2.806131
H  -2.101607 2.034766 1.309399
H  -2.659793 3.030714 -0.067814
H  1.477409 -1.896237 -1.072874
H  4.128777 1.28985 1.266649
H  -0.521679 -3.245603 0.070518
H  -5.403504 -0.014041 -0.506469
H  1.09477 -2.384635 2.455671
H  0.279792 2.712401 -1.618541
H  0.059125 2.075371 0.32353
