program: Gaussian 09
title: 000121593
version: EM64L-G09RevD.01
frameworkgroup: C1[X(C5H9BrO2)]
method: RPBEPBE
basis: SDD
operation: Freq
keyword: #p
keyword: freq=noraman
keyword: PBEPBE/SDD
title: #p freq=noraman PBEPBE/SDD
converged: YES YES NO NO
title: Mulliken charges:
elementType: Br O O C C C C C H H H H H H H H H
charge: 0.013669 -0.255851 -0.230403 0.033699 -0.672540 -0.682201 0.355298 -0.767077 0.236582 0.214664 0.253599 0.226567 0.211386 0.231808 0.227533 0.300627 0.302640
chargesum: 0.00000
title: Mulliken charges with hydrogens summed into heavy atoms:
elementType: Br O O C C C C C
charge: 0.013669 -0.255851 -0.230403 0.270280 0.022291 -0.011474 0.355298 -0.163809
polarizability: 9.12672128e+01 5.07551777e+00 7.03086559e+01 -3.36617702e+00 -1.48741685e+00 6.15545902e+01
1716.lowfreq: -8.1322 -7.2288 0.0007 0.0009 0.0010 7.5043 29.1184 52.8739 81.3762
frequency: 29.0682 52.8692 81.3688 157.0401 177.8232 190.1573 241.8994 294.9735 378.7415 398.7105 448.3238 513.4520 615.6861 725.1826 753.8616 873.0943 898.9589 928.1332 928.8754 945.9286 1081.7938 1101.6117 1159.0891 1183.0508 1220.4668 1233.9313 1322.0829 1335.6812 1382.6145 1397.5441 1426.2666 1457.6695 1465.1406 1472.7120 1486.6222 1628.0791 2991.8974 2994.8514 3027.1562 3084.3170 3088.2392 3095.5402 3099.4029 3105.6542 3182.0414
redmass: 4.2586 3.8046 5.6230 5.5475 2.0663 1.1586 1.2392 2.6158 3.2779 2.8831 2.5831 6.3227 4.9600 7.2293 3.4026 2.8609 1.7865 2.6678 1.4332 1.4335 1.5043 1.5375 2.0468 1.9594 1.4614 1.7643 1.3703 1.4485 1.2507 1.2252 1.1178 1.0520 1.0469 1.0488 1.0490 10.5262 1.0355 1.0359 1.0865 1.0556 1.0994 1.0988 1.1009 1.1008 1.1125
irintensity: 0.8586 1.3982 0.2881 2.5074 5.7422 1.5542 1.6987 1.4359 2.7266 6.6038 0.8026 21.5173 12.5694 0.2693 8.8785 6.5984 1.9602 59.4099 12.7251 2.8048 183.6636 36.3143 12.0443 34.0916 97.5740 122.9371 3.5866 3.9213 32.5811 16.6489 18.8374 6.0410 5.2287 8.0110 20.7481 193.6545 13.9609 17.1823 7.0635 6.6985 3.2997 45.9481 20.0794 30.8051 0.5669
temp: 298.150 k
press: 1.00000 atm
elementType: 35 8 8 6 6 6 6 6 1 1 1 1 1 1 1 1 1
symmnumber: 1
zpe: 350850.4 jmol-1
zpe.correction: 0.133632 hartree
zpe.thermalcorrener: 0.143583 hartree
zpe.thermalcorrenthalpy: 0.144527 hartree
zpe.thermalcorrgfe: 0.095996 hartree
zpe.sumelectzpe: -359.194232 hartree
zpe.sumelectthermal: -359.184281 hartree
zpe.sumelectthermalent: -359.183337 hartree
zpe.sumelectthermalfe: -359.231868 hartree
dipole: 2.1988 -0.3121 -1.6455
dipole: 2.7640
quadrupole: -51.4314 -58.3871 -59.3161
quadrupole: -3.3724 0.9384 -5.6394
quadrupole: 4.9468 -2.0089 -2.9379 -3.3724 0.9384 -5.6394
hfenergy: -359.3278636 hartree
pointgroup: C01 [X(C5H9Br1O2)]
dipole: -0.9429566 -0.5406381 0.0329462 debye
dipolederiv: -0.2435991 0.0227765 0.1040358 -0.0246475 -0.1317938 0.0565348 0.1754122 0.012873 -0.2662833 -1.6336009 -0.0073509 -0.2361911 -0.0022749 -0.4733926 -0.1098316 -0.313049 -0.0809287 -0.4334632 -0.6683788 0.0593009 0.0185789 -0.1560436 -0.5476319 -0.4004007 -0.2665387 -0.2214322 -0.6303055 0.951558 -0.0524438 0.0425773 -0.2272585 0.4062911 -0.0930954 -0.0814223 -0.0997168 0.2903654 -0.1109196 -0.0468244 0.0027116 0.0242497 -0.1218139 0.0837332 0.0360425 0.1127271 0.0079229 -0.1116103 -0.0578298 -0.0249788 -0.0609503 -0.0459325 0.011644 -0.0027161 0.0113452 0.0695701 1.6817014 -0.0299281 0.0977638 0.1973452 0.5549577 0.6916853 0.5547297 0.44198 0.7030207 -0.0156279 0.1235685 -0.0791115 0.1695236 0.1233786 -0.2097802 -0.141926 -0.1877006 0.3394252 -0.0060254 -0.00671 -0.0494053 0.0553762 0.0236833 -0.0191215 0.0353382 -0.0201141 -0.0990839 -0.089487 0.1228067 0.0324343 0.1349173 0.042575 0.0017082 0.0215197 -0.0118149 0.0847265 -0.0186638 -0.126436 -0.0170295 -0.1098455 0.0238265 0.005375 -0.0296942 -0.0183897 0.0732186 0.1150042 -0.0002279 0.0102067 -0.0080941 0.0504566 -0.0855934 -0.0023597 -0.0231261 -0.1085773 -0.1165411 0.0736647 0.0271794 0.1079183 0.035337 -0.0340509 0.0255091 -0.029216 0.0973189 0.1077572 0.0074185 -0.0217104 -0.0335686 -0.0770049 0.1101265 -0.0120288 0.1183895 0.0122241 0.0973793 -0.0017463 0.0355648 -0.0326605 0.0765152 -0.0363001 -0.0217465 -0.0773948 -0.1163801 0.0659724 -0.0847929 0.0425803 -0.0272958 -0.0348897 0.0024664 0.0546493 0.0263398 0.0350504 -0.0049186 0.0047541 0.0147938 -0.0066908 0.0954385 0.0249004 -0.0317194 0.0461791 -0.0587495 unknown
polarizability: 87.5649579|0.880263|61.7978923|-9.8701102|-2.8229738|73.7676087 unknown
InChI: InChI=1S/C5H9BrO2/c1-4(2)8-5(7)3-6/h4H,3H2,1-2H3
charge 0 multiplicity 1
17 atoms
Br 2.701226 -0.220767 -1.70343
O  -0.458745 -0.603333 -0.220784
O  0.766031 0.746553 1.248778
C  -1.716966 0.196054 0.05367
C  -1.705633 1.439374 -0.845461
C  -2.871269 -0.76913 -0.218606
C  0.702336 -0.185403 0.413626
C  1.880427 -1.029971 -0.034758
H  -1.677628 0.493861 1.118214
H  -2.623864 2.03049 -0.675295
H  -0.837828 2.081429 -0.619493
H  -1.669981 1.148129 -1.909825
H  -3.834177 -0.264581 -0.02088
H  -2.804335 -1.658838 0.430464
H  -2.861805 -1.10179 -1.271274
H  1.578864 -2.046602 -0.318955
H  2.677147 -1.015173 0.719812
