program: Gaussian 09
title: 000121931
version: EM64L-G09RevD.01
frameworkgroup: C1[X(C8H12N2O2)]
method: RPBEPBE
basis: SDD
operation: Freq
keyword: #p
keyword: freq=noraman
keyword: PBEPBE/SDD
title: #p freq=noraman PBEPBE/SDD
converged: NO YES NO NO
title: Mulliken charges:
elementType: O O N N C C C C C C C C H H H H H H H H H H H H
charge: -0.435285 -0.288865 -0.214509 0.000993 -0.433245 0.445792 -0.443333 -0.290787 0.036699 0.175927 -0.791516 -0.768447 0.280879 0.219035 0.246674 0.214155 0.186215 0.250444 0.249384 0.252626 0.236221 0.228209 0.266930 0.375803
chargesum: 0.00000
title: Mulliken charges with hydrogens summed into heavy atoms:
elementType: O O N N C C C C C C C C
charge: -0.059482 -0.288865 -0.214509 0.000993 0.066669 0.445792 -0.196659 0.109583 0.036699 0.175927 -0.039062 -0.037087
polarizability: 1.45969054e+02 1.71580943e+00 1.16416048e+02 6.33495084e+00 2.29490917e+00 6.48770422e+01
1716.lowfreq: -7.3567 -0.0006 0.0006 0.0009 4.4430 9.4390 50.9342 55.0740 64.6871
frequency: 50.8131 55.0223 64.6791 145.8796 168.1249 190.1087 216.8145 231.2938 280.1614 290.2957 352.4052 377.9316 466.7740 491.5883 522.4255 553.7858 574.5742 608.9202 630.9940 700.6948 709.3245 767.9455 830.7142 846.1302 891.2809 951.4471 971.4331 1006.8035 1022.7372 1042.8889 1045.4050 1054.1266 1074.0023 1097.0433 1150.6270 1190.9113 1212.2014 1268.5824 1341.6716 1348.2811 1353.6611 1391.0905 1404.6632 1405.9985 1435.6169 1446.2294 1447.8864 1464.6953 1467.4009 1472.0187 1486.7907 1518.7660 1576.7492 1617.2772 2922.3413 2985.7826 2987.7481 3031.6533 3044.3237 3065.5366 3067.2614 3107.1839 3113.0926 3126.1199 3179.4817 3295.9265
redmass: 1.9038 1.3928 4.8144 2.8910 2.9259 6.1715 4.5682 1.0794 3.2660 3.5066 4.4488 3.1915 2.5161 3.4890 5.0331 3.9606 3.5790 5.4257 3.4797 1.6171 1.8508 8.1576 1.2413 2.7372 2.6499 4.0650 2.2540 2.2956 1.4918 1.6748 1.6663 2.2649 2.8777 4.7274 5.5290 1.3668 1.2238 1.3260 1.3485 1.2833 2.7133 1.2904 2.8322 1.2543 1.2267 1.1977 1.1026 1.0530 1.0795 1.0476 1.1936 4.4032 5.7862 7.3072 1.0701 1.0389 1.0391 1.0673 1.0877 1.0961 1.0971 1.1004 1.0980 1.0986 1.0938 1.0667
irintensity: 1.0909 2.0104 0.5368 9.5765 0.1964 0.9983 4.1828 0.1875 6.7487 0.8898 10.0982 0.0050 0.7747 2.7591 2.1501 0.1114 2.3254 7.0235 2.6367 80.3072 69.0850 18.7825 23.7578 1.2770 39.2552 3.6273 3.5822 39.6001 11.3039 18.7912 8.6200 14.6937 27.9402 24.5034 7.8946 6.9623 34.4631 19.2143 50.0855 10.4609 38.1047 61.0002 50.1042 26.9506 195.8565 20.3406 78.7262 20.7226 3.5189 14.7718 10.0428 81.5379 207.4617 391.2293 69.8538 9.1276 9.8443 7.2536 63.4625 14.3982 9.9934 16.7211 13.0253 7.1070 3.0535 251.2060
temp: 298.150 k
press: 1.00000 atm
elementType: 8 8 7 7 6 6 6 6 6 6 6 6 1 1 1 1 1 1 1 1 1 1 1 1
symmnumber: 1
zpe: 509681.8 jmol-1
zpe.correction: 0.194128 hartree
zpe.thermalcorrener: 0.206196 hartree
zpe.thermalcorrenthalpy: 0.207140 hartree
zpe.thermalcorrgfe: 0.155506 hartree
zpe.sumelectzpe: -571.086268 hartree
zpe.sumelectthermal: -571.074199 hartree
zpe.sumelectthermalent: -571.073255 hartree
zpe.sumelectthermalfe: -571.124890 hartree
dipole: 3.7671 7.5665 -0.3538
dipole: 8.4598
quadrupole: -75.5084 -74.6101 -71.5962
quadrupole: -6.3969 4.5145 -0.5957
quadrupole: -1.6035 -0.7052 2.3087 -6.3969 4.5145 -0.5957
hfenergy: -571.2803955 hartree
pointgroup: C01 [X(C8H12N2O2)]
dipole: 1.1787994 -3.1030607 0.2433664 debye
dipolederiv: -0.6100215 0.1087058 -0.0281798 0.1051836 -0.6908077 0.0206207 -0.1153413 0.0401173 -0.5824706 -1.0336415 0.5391923 0.0068429 0.4508925 -1.0085125 -0.037016 -0.0039154 -0.0710564 -0.3973911 -0.6528897 -0.185364 0.0553821 0.533711 -0.7818591 -0.0714901 0.0496193 0.1268212 -0.1602288 -0.9551208 0.5834993 0.0932044 0.100974 -0.6049116 -0.002071 0.047118 -0.0470118 -0.2751933 0.3470153 0.1146809 -0.0867334 0.088257 0.0933612 -0.022982 -0.2055369 0.0247614 0.0992531 0.8784492 0.2514924 -0.1623526 -0.3556259 0.4676344 0.0826796 -0.1796099 -0.0708741 0.1046333 -0.7753928 -0.4373779 0.0727389 -0.3809665 -0.520109 0.085661 0.0844663 0.0714652 -0.2291277 0.3559795 -0.0723205 0.0056066 -0.1366513 0.5624968 0.0510478 0.1258537 -0.0195491 0.3505661 1.1380558 -0.6448923 -0.0644529 -0.5677808 1.3692859 -0.0095466 -0.0651696 -0.015064 0.2517678 0.955275 -0.0334208 -0.1548902 0.2536722 0.8939959 -0.0290236 -0.1293333 0.0239108 0.1102327 -0.0194349 -0.1424597 0.0007107 -0.0597286 -0.1687768 0.0133215 0.0298719 0.0440249 0.0359155 -0.3848589 -0.0531533 0.0828963 0.024512 0.0233428 -0.0118292 0.1671623 0.0058883 0.0008149 0.01886 -0.0162733 -0.0030121 0.0221651 0.0555025 -0.102972 0.0188873 -0.0277481 0.0027525 0.003586 -0.0003552 -0.0251423 -0.0493862 -0.0909848 0.1105383 -0.0076507 0.0726834 0.0698175 0.0522748 0.0603474 0.0291038 0.0771713 -0.0238983 -0.0303135 0.0232181 -0.0320484 0.1692197 -0.126601 -0.1108609 0.021459 -0.0990117 -0.029545 0.0102482 0.0195025 0.0446851 0.0682188 0.0040394 0.0963063 0.1130502 0.0561934 -0.0558943 -0.0780731 0.0612199 -0.0902568 -0.1506515 0.086636 -0.045529 0.0626128 -0.042721 0.0610306 0.0044932 0.0616235 0.0478518 -0.0632184 -0.0080904 0.1420698 0.0547298 0.0476127 0.0210775 -0.0255338 0.0455874 -0.0616569 0.1010428 -0.0404171 -0.0446156 -0.0927076 -0.0111879 0.0649216 0.0286 -0.1029332 -0.0157082 0.0486145 0.0481703 -0.008069 0.0258147 -0.0185495 0.0945812 -0.0653868 0.0619611 -0.0500624 -0.076818 0.0082575 0.0340235 -0.0469644 0.0550264 0.0179586 0.1060538 -0.1007309 0.084115 0.0352436 0.0926547 -0.0017521 0.0023122 -0.0876103 -0.0538922 -0.023423 -0.0263715 -0.0344286 0.1186823 0.6172149 -0.1338741 0.0379708 -0.0061516 0.3040023 -0.0036035 0.1405015 -0.0508595 0.3683242 unknown
polarizability: 144.4988057|-5.0281911|117.2536992|-9.8636343|0.4361371|65.5096399 unknown
InChI: InChI=1S/C8H12N2O2/c1-6-5-7(2)10(3-4-11)8(12)9-6/h5,11H,3-4H2,1-2H3
charge 0 multiplicity 1
24 atoms
O  -3.373886 1.323617 -0.398323
O  -0.817796 2.027626 0.21032
N  -0.519807 -0.293975 0.320738
N  1.365896 1.215345 -0.042832
C  -1.951825 -0.406432 0.726262
C  0.27649 -1.404752 0.067927
C  1.620304 -1.199499 -0.245248
C  -2.9690 -0.067819 -0.403552
C  -0.001282 1.05475 0.157007
C  2.14626 0.135394 -0.245013
C  -0.319012 -2.79085 0.144374
C  3.617583 0.381531 -0.482813
H  -2.119749 0.302013 1.557277
H  -2.11642 -1.427479 1.10176
H  2.26643 -2.053703 -0.456267
H  -3.892516 -0.651571 -0.237533
H  -2.537385 -0.376372 -1.383386
H  -0.611887 -3.058207 1.177013
H  0.424797 -3.529327 -0.192695
H  -1.215514 -2.891153 -0.493764
H  3.891819 0.127185 -1.524572
H  4.241718 -0.243329 0.181866
H  3.847565 1.443531 -0.310998
H  -2.541781 1.865678 -0.238446
