program: Gaussian 09
title: 000119367
version: EM64L-G09RevD.01
frameworkgroup: C1[X(C19H13F2NO4)]
method: RPBEPBE
basis: SDD
operation: Freq
keyword: #p
keyword: freq=noraman
keyword: PBEPBE/SDD
title: #p freq=noraman PBEPBE/SDD
converged: YES YES NO NO
title: Mulliken charges:
elementType: F F O O O O N C C C C C C C C C C C C C C C C C C C H H H H H H H H H H H H H
charge: -0.184481 -0.181399 -0.216625 -0.383121 -0.282525 -0.425709 -0.163555 -0.132999 -0.521398 -0.466234 0.121971 -0.314994 0.224207 0.097474 0.133571 0.079753 0.026661 -0.625380 0.243353 0.373020 0.104272 -0.342068 -0.342599 -0.397144 -0.356126 0.287528 0.282373 0.256595 0.253690 0.244975 0.265576 0.308555 0.314327 0.252162 0.248117 0.224966 0.254662 0.379792 0.358759
chargesum: 0.00000
title: Mulliken charges with hydrogens summed into heavy atoms:
elementType: F F O O O O N C C C C C C C C C C C C C C C C C C C
charge: -0.184481 -0.181399 -0.216625 -0.003329 -0.282525 -0.066949 -0.163555 0.149374 -0.011113 0.044316 0.121971 -0.006440 0.224207 0.097474 0.133571 0.079753 0.026661 -0.311053 0.243353 0.373020 0.104272 -0.089907 -0.094483 -0.172178 -0.101464 0.287528
polarizability: 4.14341074e+02 -1.46995635e+01 2.27083621e+02 -8.71196611e+00 -2.00077388e+01 1.24280139e+02
1716.lowfreq: -4.4726 -1.1790 -0.0008 0.0005 0.0009 6.7700 23.5765 36.6982 38.0507
frequency: 23.5594 36.6974 38.0130 49.4647 57.1600 66.9558 83.5855 111.4210 135.2147 140.5459 170.3926 179.2238 199.8553 213.0081 242.7822 266.9610 284.4731 311.3709 336.0301 345.7026 357.1051 371.3444 379.5725 381.9818 388.0210 411.7964 414.3962 430.3932 472.3971 507.2620 515.2561 532.0236 542.2065 549.4629 592.2727 600.9530 622.9939 628.8152 641.2221 645.7183 705.1298 711.4835 726.1663 749.7125 762.4302 788.7613 797.0958 805.1204 809.9049 821.6772 838.4151 840.5053 880.9323 925.7619 942.2749 944.2056 962.1770 964.6861 970.9828 978.7756 1007.3101 1013.8372 1059.3562 1061.9819 1085.0209 1098.5795 1107.1099 1112.4363 1131.5306 1146.0588 1166.6028 1174.4223 1191.1711 1203.1113 1239.7377 1257.4750 1271.9940 1293.5794 1306.4645 1328.8498 1353.6001 1361.1283 1371.9683 1383.5051 1385.1764 1427.1411 1438.6874 1443.8771 1447.7610 1466.0579 1513.4515 1534.3250 1560.7124 1585.4699 1589.1944 1619.3989 1624.1310 1630.3254 3107.5871 3115.2493 3121.5443 3144.0407 3159.7212 3170.2161 3170.6628 3176.7618 3181.0950 3207.5489 3224.9256 3497.1458 3579.8516
redmass: 7.5541 10.7169 5.2582 9.1594 7.3811 4.5845 3.1649 6.6220 8.1819 3.5528 9.2452 5.6483 7.5490 7.6794 6.2261 8.5563 12.0599 6.4666 6.3168 5.5399 10.6776 5.7590 4.3932 1.2282 7.1690 2.9900 4.9905 7.5550 4.2659 3.3443 8.5692 4.8918 4.5256 3.7661 4.9250 1.7500 5.3682 5.5684 4.8023 3.7749 5.2890 4.4362 5.2830 6.1428 1.5115 4.7429 6.6604 2.6054 1.4027 4.1045 1.3850 1.7362 4.2249 1.4340 2.0171 2.0363 6.3651 1.3959 1.5656 5.9235 2.9757 3.0280 2.6765 1.2349 1.2358 2.5418 1.2530 1.5298 1.6914 1.3265 1.3761 1.8756 1.1257 2.3422 3.9899 2.4666 2.9843 2.5903 1.9553 1.8710 3.1879 2.0633 5.5386 3.4745 5.9278 4.1403 1.1163 4.5701 5.7636 1.3130 3.0906 9.7342 9.1774 7.7790 6.4705 7.8979 7.9035 7.5924 1.0521 1.0623 1.0901 1.0914 1.0883 1.0945 1.0922 1.0923 1.0975 1.1173 1.1148 1.0636 1.0660
irintensity: 0.0521 2.1759 1.4030 1.4690 0.5255 0.9595 0.0852 1.9202 0.0105 1.4594 1.5829 0.0627 0.7973 0.2327 0.5398 6.9826 0.6103 6.3227 1.9702 5.6369 0.5555 12.2814 8.2919 136.0791 12.1643 2.1007 11.4969 4.7539 17.6469 11.7800 25.9419 11.1525 7.3101 11.2641 50.7960 82.9488 40.5454 6.3743 11.3978 23.9637 20.1914 13.6037 10.9446 0.6045 7.2869 25.3169 27.9055 28.3205 9.2066 40.5705 25.1490 17.4919 12.6125 21.6313 10.7482 15.9208 25.9749 2.8118 27.0308 30.8080 11.7684 58.0123 336.7270 42.8827 14.9187 33.2848 0.9904 48.0831 50.6502 270.7080 2.2930 25.3972 37.3289 7.3928 11.2512 18.1722 38.4444 217.1691 61.5664 21.2404 17.6475 18.4173 48.8334 9.3103 42.2577 52.1683 7.4813 24.3311 249.2896 15.7032 36.1526 154.5684 97.0088 431.7651 58.0834 150.8219 208.2612 74.3840 7.6031 1.1967 21.7631 7.3272 4.6847 5.7004 11.4843 4.4882 4.0042 1.3440 14.8415 40.4875 74.9938
temp: 298.150 k
press: 1.00000 atm
elementType: 9 9 8 8 8 8 7 6 6 6 6 6 6 6 6 6 6 6 6 6 6 6 6 6 6 6 1 1 1 1 1 1 1 1 1 1 1 1 1
symmnumber: 1
zpe: 730037.3 jmol-1
zpe.correction: 0.278057 hartree
zpe.thermalcorrener: 0.300229 hartree
zpe.thermalcorrenthalpy: 0.301173 hartree
zpe.thermalcorrgfe: 0.225474 hartree
zpe.sumelectzpe: -1285.311690 hartree
zpe.sumelectthermal: -1285.289517 hartree
zpe.sumelectthermalent: -1285.288573 hartree
zpe.sumelectthermalfe: -1285.364272 hartree
dipole: -3.9451 4.4930 1.2617
dipole: 6.1109
quadrupole: -144.1711 -151.5692 -143.5074
quadrupole: 13.3338 -10.7368 -2.1987
quadrupole: 2.2448 -5.1533 2.9085 13.3338 -10.7368 -2.1987
hfenergy: -1285.5897464 hartree
pointgroup: C01 [X(C19H13F2N1O4)]
dipole: 1.5814024 1.8040093 -0.1578872 debye
polarizability: 414.8500769|12.7082185|216.1578653|-3.4352811|37.1547961|134.6968909 unknown
InChI: InChI=1S/C19H13F2NO4/c20-14-7-12-17(16(21)15(14)9-1-5-11(23)6-2-9)22(10-3-4-10)8-13(18(12)24)19(25)26/h1-2,5-8,10,23,25H,3-4H2
charge 0 multiplicity 1
39 atoms
F  1.035717 1.686626 0.565632
F  1.845138 -2.858066 -0.865612
O  -3.153556 -2.555521 -0.810928
O  -5.698214 -1.648666 -0.088071
O  -5.913985 0.61442 0.343873
O  7.139967 0.349519 0.330448
N  -1.826338 1.277666 0.269168
C  -1.442607 2.6823 0.493762
C  -2.313518 3.80429 -0.078957
C  -0.925389 3.523283 -0.673067
C  -0.86777 0.25616 0.018024
C  -3.159554 0.950475 0.284462
C  -1.337003 -1.043187 -0.355235
C  -3.690422 -0.303376 -0.012275
C  0.539862 0.437149 0.132042
C  -2.798435 -1.397731 -0.424438
C  1.502055 -0.555543 -0.163202
C  -0.40655 -2.064738 -0.65624
C  0.956022 -1.806044 -0.573632
C  2.966728 -0.320729 -0.045904
C  -5.169596 -0.376542 0.093899
C  3.852182 -0.797526 -1.049893
C  3.522594 0.370259 1.067936
C  5.240875 -0.58535 -0.95539
C  4.907785 0.579648 1.17805
C  5.770016 0.104142 0.162741
H  -0.98062 2.853046 1.469588
H  -2.455732 4.689775 0.545787
H  -3.179324 3.542878 -0.693911
H  -0.896339 3.051748 -1.659847
H  -0.098866 4.207637 -0.4692
H  -3.849888 1.756377 0.545577
H  -0.794619 -3.048023 -0.937805
H  3.455053 -1.333433 -1.916461
H  2.867382 0.736249 1.863115
H  5.904601 -0.957788 -1.746059
H  5.337357 1.102052 2.037373
H  -6.688811 -1.584774 0.006313
H  7.664702 -0.024662 -0.420462
