program: Gaussian 09
title: 000118799
version: EM64L-G09RevD.01
frameworkgroup: C1[X(C12H18N4O2)]
method: RPBEPBE
basis: SDD
operation: Freq
keyword: #p
keyword: freq=noraman
keyword: PBEPBE/SDD
title: #p freq=noraman PBEPBE/SDD
converged: YES YES NO NO
title: Mulliken charges:
elementType: O O N N N N C C C C C C C C C C C C H H H H H H H H H H H H H H H H H H
charge: -0.305708 -0.300236 -0.525454 -0.539016 -0.160916 -0.159684 0.270356 0.274537 -0.309102 -0.302654 0.286647 0.283656 -0.241376 -0.247423 -0.629217 -0.668760 -0.629222 -0.668357 0.326562 0.321285 0.293156 0.283122 0.224833 0.225184 0.222402 0.224400 0.290027 0.249616 0.221871 0.240419 0.222281 0.224725 0.289975 0.238788 0.250131 0.223152
chargesum: 0.00000
title: Mulliken charges with hydrogens summed into heavy atoms:
elementType: O O N N N N C C C C C C C C C C C C
charge: -0.305708 -0.300236 -0.198892 -0.217731 -0.160916 -0.159684 0.270356 0.274537 -0.015946 -0.019532 0.286647 0.283656 -0.016543 -0.022239 0.107612 0.043146 0.107760 0.043713
polarizability: 2.10989587e+02 3.05957283e-01 2.17075025e+02 -3.98510644e+00 -9.24965527e-01 9.52935710e+01
1716.lowfreq: -15.8075 -8.2843 -3.7187 -0.0004 0.0004 0.0005 6.2513 29.3431 50.0486
frequency: -13.5210 28.9905 50.0361 58.1370 66.3794 71.0929 102.7337 122.3722 129.8172 139.8695 166.0834 171.6351 191.7021 216.4209 219.7305 225.1500 253.6234 293.4458 300.8485 363.1207 378.2832 410.5187 420.6924 432.7033 450.1243 483.5713 543.6547 584.5855 598.5806 618.5817 631.1048 666.8568 701.7792 703.4023 728.6167 760.0656 807.9220 850.0423 857.8995 860.1039 878.7004 947.1037 978.7411 999.4062 1002.3804 1044.1356 1058.3597 1059.6054 1091.9529 1095.6626 1100.0181 1135.0158 1135.6765 1153.8103 1160.3699 1174.1641 1209.2399 1256.3066 1257.7815 1294.2765 1298.7863 1328.1295 1341.8071 1381.7733 1417.0097 1417.6242 1438.7521 1445.1336 1448.3359 1463.9361 1470.3579 1478.5077 1480.9312 1484.1936 1489.2063 1493.2563 1493.8702 1496.6513 1499.7354 1517.5351 1599.3898 1614.3365 1623.3593 1625.6993 2927.1749 2929.2260 2964.2530 2965.3613 2996.2136 2997.4156 3038.1066 3039.1668 3096.6449 3097.0228 3115.7857 3116.4260 3134.5037 3156.2517 3191.0083 3195.1292 3512.4856 3515.6212
redmass: 3.9241 3.3837 3.6052 2.7743 3.7430 3.0879 2.4539 1.5737 1.8429 3.2894 1.1040 1.1869 3.3052 2.9992 2.4604 2.8515 5.2336 4.3088 3.8155 3.2964 3.5694 1.9956 3.0164 3.0545 3.5883 2.6096 3.6412 4.7692 5.5797 5.3861 5.1791 1.2209 10.6602 10.1213 4.2709 1.2711 5.5347 5.4719 2.5169 3.2221 2.6317 1.3777 1.3078 2.7495 2.5722 2.0124 1.4176 1.4120 1.2402 1.2354 2.0607 1.3278 1.3285 2.2238 2.3050 1.0576 1.6626 5.5062 4.8369 2.2145 1.8572 2.8450 2.9038 5.4690 1.1506 1.1515 2.1996 1.2028 1.2148 1.9974 1.6001 1.0499 1.0466 1.2108 1.2478 1.0501 1.0547 1.1439 1.1268 2.5437 6.0805 5.2309 4.9003 6.9472 1.0411 1.0400 1.0366 1.0365 1.0999 1.0985 1.1024 1.1025 1.0938 1.0938 1.0963 1.0964 1.0865 1.0947 1.0941 1.0959 1.0748 1.0748
irintensity: 10.1753 3.5732 0.3844 1.4740 2.9107 13.5799 2.4579 0.7899 0.3656 6.2484 0.0477 0.7496 0.0056 1.7466 0.7489 0.9909 2.6729 3.9693 8.2652 46.0444 14.5032 53.3104 7.1712 29.9378 1.7445 32.4863 0.2374 8.9982 2.6795 0.8490 2.3647 45.3506 0.7283 31.0220 0.7799 109.3853 0.3932 3.3880 2.0388 3.4168 4.3639 4.4917 1.2121 36.7619 40.2964 6.9730 15.2498 20.6804 0.3631 0.7374 3.1671 1.4262 0.8461 238.2918 195.8813 0.0833 29.8403 7.1732 25.6106 95.5711 68.6404 32.8548 107.5539 79.4470 43.7245 29.2227 452.8728 51.4256 110.1275 9.2370 237.0059 39.9339 9.6200 18.0975 88.4085 17.8069 22.5023 150.2357 32.2303 345.2109 5.9727 52.0733 297.7919 128.8885 70.1663 58.8906 99.8334 98.8143 48.6962 40.4974 43.3751 45.3975 18.7355 20.8023 0.7682 0.7595 5.5114 28.2811 0.6894 5.7894 26.6949 9.2813
temp: 298.150 k
press: 1.00000 atm
elementType: 8 8 7 7 7 7 6 6 6 6 6 6 6 6 6 6 6 6 1 1 1 1 1 1 1 1 1 1 1 1 1 1 1 1 1 1
symmnumber: 1
zpe: 771765.4 jmol-1
zpe.correction: 0.293950 hartree
zpe.thermalcorrener: 0.312735 hartree
zpe.thermalcorrenthalpy: 0.313679 hartree
zpe.thermalcorrgfe: 0.246152 hartree
zpe.sumelectzpe: -836.192226 hartree
zpe.sumelectthermal: -836.173441 hartree
zpe.sumelectthermalent: -836.172497 hartree
zpe.sumelectthermalfe: -836.240024 hartree
dipole: 0.3577 -7.3176 0.5040
dipole: 7.3436
quadrupole: -113.8679 -89.3957 -111.5861
quadrupole: 0.1032 12.4018 -0.0116
quadrupole: -8.9180 15.5542 -6.6362 0.1032 12.4018 -0.0116
hfenergy: -836.4861757 hartree
pointgroup: C01 [X(C12H18N4O2)]
dipole: -0.1205258 2.8866854 0.0083525 debye
polarizability: 209.9979499|1.0396646|216.6980384|11.3850032|-6.7283132|96.6621948 unknown
InChI: InChI=1S/C12H18N4O2/c1-15(2)11(17)13-9-7-5-6-8-10(9)14-12(18)16(3)4/h5-8,13-14H,1-4H3
charge 0 multiplicity 1
36 atoms
O  3.475554 -0.3363 0.775289
O  -3.34489 -0.376922 -1.116336
N  1.367524 0.162326 -0.156555
N  -1.364097 0.183523 0.032401
N  3.114924 1.748536 -0.235344
N  -3.110315 1.762163 -0.183987
C  0.717207 -1.099455 0.003935
C  -0.714454 -1.094014 0.008142
C  1.414116 -2.326852 0.113289
C  -1.423652 -2.316801 0.030164
C  2.70392 0.466985 0.165213
C  -2.654408 0.463614 -0.462429
C  0.693687 -3.53862 0.166262
C  -0.718528 -3.53673 0.100691
C  4.48696 2.171842 0.087152
C  2.242039 2.696529 -0.939613
C  -4.438532 2.155112 -0.68114
C  -2.320796 2.756335 0.554284
H  0.828672 0.846014 -0.692882
H  -0.909866 0.884202 0.622634
H  2.504357 -2.312262 0.160405
H  -2.514026 -2.296254 -0.018181
H  1.240858 -4.484185 0.24589
H  -1.274524 -4.480139 0.118455
H  4.485732 3.056491 0.753191
H  5.052474 2.416876 -0.832368
H  4.986022 1.337662 0.603197
H  2.820311 3.602467 -1.180496
H  1.375521 3.017442 -0.3217
H  1.865096 2.288578 -1.900054
H  -4.365291 3.010687 -1.380101
H  -5.109742 2.431918 0.154533
H  -4.867775 1.293968 -1.215345
H  -2.071445 2.42029 1.582172
H  -2.912743 3.679809 0.653946
H  -1.380089 3.026363 0.027785
