program: Gaussian 09
title: 000118776
version: EM64L-G09RevD.01
frameworkgroup: C1[X(C16H30O2)]
method: RPBEPBE
basis: SDD
operation: Freq
keyword: #pfreq=noraman
keyword: PBEPBE/SDD
title: #p freq=noraman PBEPBE/SDD
converged: YES YES NO NO
title: Mulliken charges:
elementType: O O C C C C C C C C C C C C C C C C H H H H H H H H H H H H H H H H H H H H H H H H H H H H H H
charge: -0.256514 -0.250936 -0.382312 -0.386119 -0.380951 -0.373761 -0.380247 -0.378178 -0.393724 -0.458027 -0.282223 -0.190997 -0.192851 -0.445130 -0.358662 -0.677965 0.285844 -0.751743 0.194236 0.194157 0.193503 0.195529 0.195860 0.196021 0.194622 0.190172 0.195465 0.195331 0.208493 0.194397 0.212507 0.212598 0.195625 0.204480 0.227730 0.227908 0.224084 0.220970 0.203640 0.198012 0.202217 0.194756 0.205056 0.228848 0.210203 0.246811 0.244485 0.246782
chargesum: 0.00000
title: Mulliken charges with hydrogens summed into heavy atoms:
elementType: O O C C C C C C C C C C C C C C C C
charge: -0.256514 -0.250936 0.006081 0.002914 0.010930 0.011033 0.010549 0.024712 0.031380 -0.057922 0.173414 0.033086 0.028119 -0.043478 0.038311 -0.033858 0.285844 -0.013665
polarizability: 2.54443389e+02 -5.26632577e+00 1.58156806e+02 5.77389996e+00 4.40162060e+00 1.45011446e+02
1716.lowfreq: -42.7304 -12.6172 -3.0622 -0.0015 -0.0010 0.0011 3.6290 11.8572 17.5820
frequency: -42.7029 11.0133 17.1330 19.5015 26.8255 36.5086 49.8615 60.7519 65.7973 80.5273 97.7838 101.7801 115.5219 132.3287 137.2972 143.5561 150.2763 170.5627 189.4668 200.2124 234.0623 251.9768 282.7625 325.7665 345.1440 390.7919 426.4267 449.0239 467.8880 495.2880 522.0033 566.9742 614.2764 719.3599 724.9551 738.5325 755.2405 769.9650 793.2098 809.7278 832.2676 856.7858 877.8713 881.9289 933.3512 934.8014 964.3139 978.1683 984.1419 993.6137 1002.7860 1008.8894 1028.1550 1037.9943 1041.4609 1058.5192 1063.0528 1072.2727 1078.9778 1080.4253 1081.6318 1107.6028 1112.2127 1150.1953 1162.9279 1196.0774 1202.1346 1207.8312 1213.1221 1229.9348 1236.7952 1251.8718 1258.3038 1267.7229 1272.4232 1280.8904 1282.7616 1288.4043 1292.9923 1295.2135 1297.7387 1306.4482 1325.9021 1336.9390 1342.5303 1349.1891 1355.7529 1358.5541 1371.6861 1382.8560 1387.6084 1453.2678 1454.8914 1456.9118 1457.5602 1460.2839 1461.8047 1464.5004 1467.7399 1468.5565 1472.1197 1475.0772 1478.9401 1484.7387 1485.4639 1489.8705 1648.8820 1684.6061 2947.8722 2950.6023 2951.1346 2952.8880 2954.2358 2957.5827 2963.8308 2967.5200 2970.9119 2975.4881 2983.8360 2989.4102 2990.0424 2998.5633 2999.4262 3006.4463 3007.5741 3013.4711 3018.2295 3026.2619 3032.1536 3041.7755 3046.0878 3056.9446 3066.7735 3070.2354 3073.7109 3077.0623 3095.6286 3142.6574
redmass: 1.0326 4.5056 4.1907 3.5287 3.6336 3.1424 2.5974 2.2975 2.7221 2.5291 2.6600 1.9487 2.4655 2.1506 2.5658 2.8563 1.9780 2.4053 2.7821 2.5048 1.3825 3.9520 4.0711 2.4437 2.8210 3.4776 2.8371 2.5884 2.8783 3.0494 2.5935 2.9893 4.8677 1.0612 1.0786 1.1100 1.2011 1.1825 1.6564 1.2780 6.1951 1.6438 1.5286 1.5581 1.7217 3.0276 1.3727 1.2865 3.4811 3.5351 2.1428 1.3137 3.2998 2.4285 1.6691 2.2602 1.4335 2.6799 2.4127 2.1091 2.3398 3.3093 2.2821 1.4404 2.0444 1.5602 1.2718 3.5395 1.3350 1.3461 1.2885 1.2727 1.2504 1.2688 1.1233 1.1292 1.0824 1.2323 1.1906 1.1083 1.1399 1.3006 1.3501 1.4120 1.4130 1.5220 1.6256 1.6130 1.4634 1.3185 1.2211 1.0636 1.0472 1.0840 1.0943 1.0754 1.0711 1.0748 1.0773 1.0719 1.0941 1.0445 1.0958 1.0658 1.0917 1.0984 9.1857 6.5959 1.0614 1.0588 1.0588 1.0610 1.0590 1.0595 1.0596 1.0594 1.0563 1.0409 1.0962 1.0597 1.0977 1.0990 1.0566 1.0995 1.0367 1.0977 1.1033 1.1000 1.1041 1.1039 1.1045 1.0939 1.0910 1.0965 1.1078 1.1000 1.0974 1.1010
irintensity: 1.0621 0.1509 1.2802 0.0545 0.1676 0.1533 0.3240 0.3503 0.0542 0.1662 0.3531 0.2928 0.3078 0.5472 0.7128 0.2815 0.2536 0.8083 7.1164 1.8393 1.1390 3.4264 3.1950 0.6796 6.1803 0.9173 1.1831 2.5453 2.2913 1.6454 0.2259 2.6672 4.7454 14.7936 0.3854 5.1133 4.9524 3.5616 4.0731 0.6521 17.8275 0.3555 2.0866 3.3261 6.9352 28.2306 10.9956 36.6685 7.3658 0.4702 118.1971 3.3443 4.4707 1.7168 9.6113 8.1110 11.8025 13.7085 1.2289 0.4062 0.7879 11.6515 2.1815 1.2492 2.2317 0.4792 31.3889 377.6606 4.2367 0.4758 2.5969 1.0520 0.3563 1.2782 0.1716 0.2748 0.4992 3.3335 0.9396 0.1610 0.3889 0.2431 1.8212 1.6833 0.5443 0.2848 0.0809 0.2645 13.8548 41.7324 12.6155 28.6387 17.9084 2.1473 7.7700 0.1529 0.7800 0.3638 0.1127 4.3563 0.7524 15.0659 3.1072 9.3456 3.6471 30.6956 203.6982 0.1955 18.2126 5.7570 0.4424 35.0168 3.3424 0.6193 15.2883 183.6242 66.4363 19.8988 0.8864 16.3777 0.8282 3.1974 43.6811 2.1511 4.5611 30.1882 2.2650 29.0743 6.6440 76.2017 119.7715 3.5376 22.7872 117.3246 88.3294 66.3812 9.4527 11.9192
temp: 298.150 k
press: 1.00000 atm
elementType: 8 8 6 6 6 6 6 6 6 6 6 6 6 6 6 6 6 6 1 1 1 1 1 1 1 1 1 1 1 1 1 1 1 1 1 1 1 1 1 1 1 1 1 1 1 1 1 1
symmnumber: 1
zpe: 1119104.6 jmol-1
zpe.correction: 0.426244 hartree
zpe.thermalcorrener: 0.449373 hartree
zpe.thermalcorrenthalpy: 0.450317 hartree
zpe.thermalcorrgfe: 0.367335 hartree
zpe.sumelectzpe: -776.663252 hartree
zpe.sumelectthermal: -776.640124 hartree
zpe.sumelectthermalent: -776.639180 hartree
zpe.sumelectthermalfe: -776.722162 hartree
dipole: -1.5551 1.3676 0.8077
dipole: 2.2228
quadrupole: -129.2903 -116.3629 -111.6040
quadrupole: 13.6477 9.2233 -2.2221
quadrupole: -10.2046 2.7228 7.4818 13.6477 9.2233 -2.2221
hfenergy: -777.0894967 hartree
pointgroup: C01 [X(C16H30O2)]
dipole: 0.6088391 0.5155499 -0.3582101 debye
polarizability: 254.2991284|6.5536587|157.4593769|5.7732825|-5.339662|145.8531356 unknown
InChI: InChI=1S/C16H30O2/c1-3-4-5-6-7-8-9-10-11-12-13-14-15-18-16(2)17/h5-6H,3-4,7-15H2,1-2H3
charge 0 multiplicity 1
48 atoms
O  -6.798932 0.661452 -0.262166
O  -8.366355 -0.736706 0.749021
C  -0.615337 -0.784898 0.150258
C  0.740412 -0.209334 -0.317498
C  -1.826661 0.066717 -0.290878
C  1.949733 -1.064561 0.122631
C  -3.179862 -0.511033 0.181148
C  3.30723 -0.491494 -0.341906
C  -4.386121 0.348996 -0.263647
C  4.512932 -1.361649 0.104226
C  -5.710478 -0.245785 0.213965
C  5.842156 -0.842366 -0.403326
C  6.899015 -0.490587 0.375429
C  8.234595 0.019168 -0.127267
C  8.629108 1.402615 0.464337
C  7.695613 2.545969 0.012475
C  -8.102897 0.290105 0.082436
C  -9.099094 1.292773 -0.460741
H  -0.61266 -0.873129 1.256951
H  -0.730194 -1.816811 -0.242978
H  0.73852 -0.11967 -1.424077
H  0.857574 0.821648 0.07712
H  -1.83117 0.153146 -1.397448
H  -1.711661 1.098729 0.101262
H  1.950689 -1.156287 1.229078
H  1.832878 -2.095376 -0.27361
H  -3.172948 -0.598306 1.287625
H  -3.293386 -1.542784 -0.212186
H  3.435658 0.536202 0.053681
H  3.310437 -0.40294 -1.448325
H  -4.402047 0.433173 -1.367408
H  -4.283572 1.376427 0.135743
H  4.349132 -2.3952 -0.270437
H  4.533971 -1.4264 1.210362
H  -5.890488 -1.255653 -0.199811
H  -5.767107 -0.312864 1.316528
H  5.93691 -0.74652 -1.497977
H  6.801273 -0.579499 1.470781
H  9.027541 -0.711512 0.13959
H  8.218305 0.08232 -1.233672
H  9.671474 1.634778 0.167999
H  8.625613 1.335461 1.571516
H  7.725658 2.668322 -1.086969
H  6.648306 2.335275 0.295636
H  7.989714 3.509059 0.469159
H  -8.888717 2.296658 -0.052924
H  -10.118986 0.986641 -0.187557
H  -9.010471 1.360231 -1.558853
