program: Gaussian 09
title: 000118873
version: EM64L-G09RevD.01
frameworkgroup: C1[X(C20H25N3OS2)]
method: RPBEPBE
basis: SDD
operation: Freq
keyword: #p
keyword: freq=noraman
keyword: PBEPBE/SDD
title: #p freq=noraman PBEPBE/SDD
converged: YES YES NO NO
title: Mulliken charges:
elementType: S S O N N N C C C C C C C C C C C C C C C C C C C C H H H H H H H H H H H H H H H H H H H H H H H H H
charge: 0.161143 0.308370 -0.211881 -0.126267 -0.300814 0.046507 -0.053223 -0.029551 -0.324510 -0.690234 -0.685970 -0.697617 -0.692039 -0.671663 -0.116487 0.457451 0.482368 -0.360940 -0.503781 -0.297150 -0.225822 -0.253127 -0.222917 -0.236451 -0.166906 -0.364149 0.229181 0.198358 0.245725 0.212436 0.211082 0.204943 0.220522 0.226374 0.208467 0.199330 0.210479 0.204601 0.238842 0.227225 0.203931 0.206666 0.271650 0.290432 0.272142 0.281731 0.254689 0.235901 0.236458 0.234911 0.249585
chargesum: 0.00000
title: Mulliken charges with hydrogens summed into heavy atoms:
elementType: S S O N N N C C C C C C C C C C C C C C C C C C C C
charge: 0.161143 0.308370 -0.211881 -0.126267 -0.300814 0.046507 0.175958 0.168807 0.133651 -0.053687 -0.051799 -0.043695 -0.054217 -0.109581 -0.116487 0.457451 0.482368 -0.360940 -0.503781 -0.025008 0.055909 0.001562 0.012984 0.000007 0.068005 -0.114564
polarizability: 3.10511173e+02 -5.60971404e+00 3.29533316e+02 2.82825256e+01 -2.59981085e-01 2.19089120e+02
1716.lowfreq: -5.1799 -4.0054 -1.5776 -0.0013 0.0006 0.0007 14.9808 15.2128 18.8085
frequency: 14.6825 15.1076 18.5335 44.8289 51.9439 59.1848 61.2217 72.9257 87.9500 91.8468 116.1461 129.4706 154.5171 170.4427 198.1766 206.9832 212.8171 226.8746 237.2175 244.3317 257.7975 264.0561 272.6015 292.4162 302.3288 326.8617 331.3325 356.6775 375.2758 378.9558 387.8627 390.1836 424.2685 447.4402 456.4605 475.7078 488.9981 507.1914 519.0429 527.8887 542.7814 550.6741 606.1698 625.1714 649.3116 652.2687 675.0465 702.6708 705.5079 722.7608 740.7452 744.1301 760.9462 793.5837 821.9470 833.1636 863.1032 877.2111 905.2888 906.1993 922.4460 923.6634 925.9560 934.2851 945.8121 967.9195 972.7188 984.4909 1025.0587 1026.6651 1037.1606 1043.8339 1046.6509 1055.3147 1062.6566 1117.1672 1120.4547 1124.0510 1126.0367 1130.9891 1149.3266 1159.2648 1163.0356 1174.2487 1212.3249 1222.4000 1225.5214 1247.0924 1255.0196 1264.3144 1295.4834 1297.1633 1305.4553 1313.2066 1327.5774 1353.6714 1367.0468 1368.7883 1372.0488 1376.2778 1385.0592 1388.5309 1397.9110 1400.8263 1415.7132 1422.6030 1429.4466 1457.2196 1460.2986 1463.3262 1463.5825 1467.5721 1473.3735 1477.4423 1480.8382 1485.3561 1487.6292 1545.3237 1562.8279 1580.9691 1585.5337 1601.0110 2947.3415 2971.4140 2972.0651 2976.9684 2979.6183 2988.7790 3001.5228 3040.5166 3046.0633 3060.7358 3062.8782 3070.6883 3071.8062 3076.2171 3086.4594 3088.5636 3095.8702 3123.8120 3138.3668 3144.2369 3149.7642 3162.1522 3168.2477 3175.0220 3193.5692
redmass: 4.6075 5.3264 3.7411 3.3482 3.6214 6.0682 5.3154 4.4001 3.4589 7.0373 3.2794 4.5162 5.3200 3.8444 1.1065 1.0885 3.7173 2.8201 2.0234 1.4769 2.4618 1.3168 4.9736 2.5353 3.7240 2.7029 5.5785 7.4620 5.6282 3.5224 8.8846 2.1939 13.7033 3.6744 5.0934 3.0321 5.4691 3.0537 4.2099 7.7842 5.2515 2.4967 6.7794 9.4570 5.3013 5.4788 7.7857 4.4254 3.6721 4.3354 1.2944 3.8796 1.2904 1.8397 3.4206 2.4664 1.3476 2.4247 1.2727 1.3164 1.3151 1.6042 1.3693 3.7711 1.4394 1.8186 1.3982 1.3272 3.7479 4.0556 3.5862 2.0734 2.2914 2.4455 2.2664 2.2647 1.9301 2.0367 2.3179 1.7118 1.8107 1.9506 1.8922 1.0595 2.5647 1.7223 1.4795 3.1989 1.5292 1.6608 1.3527 2.5504 1.1790 1.3043 10.0088 1.2716 1.3363 1.2271 1.2119 10.1843 1.2169 1.2099 1.2839 2.4671 1.1109 2.1596 2.3145 1.0519 1.0522 2.6022 1.0599 1.0562 1.0542 1.0480 1.0559 1.0508 1.0545 5.9730 6.2404 8.8046 7.3214 7.5642 1.0670 1.0348 1.0354 1.0365 1.0365 1.0846 1.0839 1.0571 1.0944 1.0990 1.0992 1.0982 1.0986 1.1000 1.1000 1.0998 1.0985 1.1078 1.0856 1.0887 1.0902 1.0951 1.0949 1.1007 1.0974
irintensity: 0.3923 0.4371 0.0400 0.0490 0.6753 1.2668 0.7711 0.7650 0.1738 1.8643 1.1363 2.3724 1.7174 1.7990 0.5683 0.4532 1.7478 4.2082 4.0296 1.5569 2.0136 1.4840 8.0642 1.6734 8.3988 0.6066 2.4265 0.5578 1.1984 1.3324 1.2068 1.3205 5.3523 8.3651 4.7797 8.1804 9.9236 3.1965 4.7947 3.8712 6.2208 8.5273 2.0191 6.2725 67.7543 8.9482 26.5229 41.3629 10.8598 2.1419 11.0759 14.1851 64.3629 95.5673 42.8907 1.4915 2.2673 3.2311 1.5926 1.4381 0.7961 0.4801 0.1691 20.8200 2.3921 17.0427 0.4951 0.0652 15.7571 16.0601 12.9095 8.2405 17.3867 3.5154 32.6118 1.9983 78.5579 46.4445 74.8665 12.9115 115.7026 58.6810 54.3902 0.3734 118.3337 56.7648 35.4339 254.1998 15.4600 10.5616 4.3487 47.8288 2.9679 3.4291 18.8147 6.9887 9.3687 1.6519 41.7946 9.6210 26.0554 10.5279 35.0577 167.0257 16.2786 63.9173 17.4857 0.4817 1.5638 60.6453 0.2895 7.2680 2.7458 21.5716 4.7634 10.2500 7.4437 24.8567 44.7298 136.6551 29.2610 34.9600 25.9590 27.3749 22.4121 28.9974 30.3305 5.4347 16.5615 14.2295 21.4385 2.5096 0.6046 71.6192 99.7317 74.4454 26.8634 48.8601 30.1829 4.2588 0.7253 8.9456 7.3846 16.9861 26.9412 13.7160 2.0527
temp: 298.150 k
press: 1.00000 atm
elementType: 16 16 8 7 7 7 6 6 6 6 6 6 6 6 6 6 6 6 6 6 6 6 6 6 6 6 1 1 1 1 1 1 1 1 1 1 1 1 1 1 1 1 1 1 1 1 1 1 1 1 1
symmnumber: 1
zpe: 1076907.7 jmol-1
zpe.correction: 0.410172 hartree
zpe.thermalcorrener: 0.436941 hartree
zpe.thermalcorrenthalpy: 0.437885 hartree
zpe.thermalcorrgfe: 0.350444 hartree
zpe.sumelectzpe: -1810.790036 hartree
zpe.sumelectthermal: -1810.763267 hartree
zpe.sumelectthermalent: -1810.762323 hartree
zpe.sumelectthermalfe: -1810.849764 hartree
dipole: -0.6387 -0.9935 -2.1799
dipole: 2.4793
quadrupole: -163.8434 -155.1186 -170.0348
quadrupole: -7.0972 -9.0082 -4.9704
quadrupole: -0.8445 7.8803 -7.0359 -7.0972 -9.0082 -4.9704
hfenergy: -1811.2002082 hartree
pointgroup: C01 [X(C20H25N3O1S2)]
dipole: 0.2184286 -0.5223871 0.7942648 debye
polarizability: 308.9558719|1.1758117|326.8326315|31.5082679|16.2429999|223.3451067 unknown
InChI: InChI=1S/C20H25N3OS2/c1-14(2)22(15(3)4)12-13-25-20(24)23-16-8-5-6-10-18(16)26-19-17(23)9-7-11-21-19/h5-11,14-15H,12-13H2,1-4H3
charge 0 multiplicity 1
51 atoms
S  0.66496 -1.799977 0.268022
S  -3.098613 0.53354 -2.113269
O  0.619755 0.810445 1.127601
N  4.516959 -0.189649 -0.074577
N  -1.458249 -0.016638 0.419681
N  -3.379218 2.930306 -0.843109
C  4.591878 1.138453 0.595402
C  5.687407 -0.690471 -0.839213
C  3.173045 -0.611617 -0.495564
C  4.838424 2.331609 -0.372797
C  5.62441 1.14387 1.747749
C  5.650401 -0.389194 -2.367584
C  5.895266 -2.2068 -0.597819
C  2.467824 -1.342595 0.669798
C  -0.077073 -0.136837 0.68259
C  -2.29988 -1.129148 0.029557
C  -2.057256 1.296277 0.406697
C  -3.112594 -1.012904 -1.124587
C  -2.830827 1.703781 -0.715063
C  -2.384451 -2.292731 0.831147
C  -1.886517 2.222796 1.459675
C  -3.952727 -2.079614 -1.513444
C  -3.205269 -3.366875 0.430312
C  -3.981738 -3.265472 -0.747956
C  -2.455318 3.510083 1.334944
C  -3.18014 3.827731 0.165745
H  3.59188 1.289776 1.049169
H  6.568714 -0.16696 -0.420388
H  2.545159 0.249597 -0.809007
H  3.236504 -1.291517 -1.364218
H  4.752488 3.291901 0.169641
H  5.851036 2.285172 -0.815305
H  4.097666 2.336991 -1.193412
H  5.417057 0.319146 2.451713
H  5.582041 2.101671 2.298977
H  6.658229 1.024786 1.372063
H  6.593014 -0.717038 -2.845266
H  4.823512 -0.93038 -2.864685
H  5.519836 0.688712 -2.561788
H  5.999739 -2.412394 0.481666
H  6.799919 -2.570335 -1.120644
H  5.034175 -2.788844 -0.97843
H  2.960911 -2.299004 0.909339
H  2.430455 -0.704779 1.567239
H  -1.793241 -2.356576 1.749169
H  -1.296742 1.945982 2.335711
H  -4.585285 -1.974418 -2.400763
H  -3.247849 -4.273061 1.042902
H  -4.625627 -4.095089 -1.057823
H  -2.33134 4.255751 2.125525
H  -3.618606 4.819942 0.01688
