program: Gaussian 09
title: 000118877
version: EM64L-G09RevD.01
frameworkgroup: C1[X(C21H24F3N3OS2)]
method: RPBEPBE
basis: SDD
operation: Freq
keyword: #p
keyword: freq=noraman
keyword: PBEPBE/SDD
title: #p freq=noraman PBEPBE/SDD
converged: YES YES NO NO
title: Mulliken charges:
elementType: S S F F F O N N N C C C C C C C C C C C C C C C C C C C C C H H H H H H H H H H H H H H H H H H H H H H H H
charge: 0.159652 0.369748 -0.163183 -0.150285 -0.157689 -0.205196 -0.127249 -0.308385 0.051672 -0.028821 -0.052422 -0.320221 -0.691362 -0.698214 -0.687078 -0.690013 -0.668995 0.500282 -0.117330 -0.528524 0.485135 0.356465 -0.503520 -0.312297 -0.390536 -0.226983 -0.207973 0.243880 -0.162012 -0.362421 0.199740 0.228089 0.214929 0.242689 0.227499 0.204786 0.206426 0.212550 0.204324 0.239314 0.226361 0.209638 0.200124 0.212086 0.205914 0.220037 0.272526 0.292377 0.281462 0.274312 0.281820 0.246237 0.237306 0.253330
chargesum: 0.00000
title: Mulliken charges with hydrogens summed into heavy atoms:
elementType: S S F F F O N N N C C C C C C C C C C C C C C C C C C C C C
charge: 0.159652 0.369748 -0.163183 -0.150285 -0.157689 -0.205196 -0.127249 -0.308385 0.051672 0.170919 0.175667 0.137398 -0.052651 -0.042026 -0.050955 -0.051976 -0.104092 0.500282 -0.117330 -0.528524 0.485135 0.356465 -0.503520 -0.030835 -0.116224 0.054836 0.038264 0.243880 0.075294 -0.109091
polarizability: 3.39752910e+02 -1.58356262e+01 3.32455778e+02 1.76487479e+01 2.48539597e+01 2.36745739e+02
1716.lowfreq: -6.9479 -3.5988 0.0005 0.0013 0.0015 5.1771 9.6943 14.2263 15.6435
frequency: 8.8804 13.6870 15.1549 34.3665 40.6459 43.3612 55.9438 62.8072 71.4371 76.1360 87.0879 92.6207 115.0746 116.9327 147.0231 163.4343 173.6829 197.7766 206.5753 214.4716 224.9224 235.5499 241.4662 259.2849 266.0679 273.9314 279.6356 295.0721 298.1738 305.4430 325.8800 327.9013 362.9766 369.0706 377.0517 384.2883 388.7024 417.3432 430.6761 453.1384 457.0677 476.3593 489.5094 506.0121 511.3245 514.4633 536.3333 548.6997 557.7845 584.1643 616.7071 623.7483 634.3111 644.3003 679.1763 700.6349 707.5319 723.5842 739.6804 740.9491 754.1743 797.9377 799.3031 823.3171 832.5702 876.9311 904.3286 906.1780 920.8537 922.2704 926.0693 927.9345 948.7094 966.1580 975.6731 980.6302 992.5401 1005.1789 1025.0633 1029.6417 1036.5452 1045.1666 1047.5949 1062.9433 1085.8855 1117.0651 1118.9784 1125.6485 1128.7381 1130.8630 1158.0660 1160.1975 1163.2009 1195.8288 1210.6809 1228.4522 1232.5694 1249.2731 1256.1308 1279.6325 1299.0648 1304.0452 1305.3645 1315.3272 1331.1069 1350.6228 1364.7047 1367.1298 1370.5955 1373.0188 1384.3740 1387.6098 1396.5978 1398.6189 1417.2512 1423.4479 1430.7838 1453.0593 1457.6087 1461.2371 1462.9634 1468.3515 1473.1244 1477.6246 1479.7109 1485.6298 1488.5481 1548.4656 1562.8069 1580.4296 1593.9423 1598.3415 2942.6743 2971.4035 2972.7070 2977.6926 2979.0445 2988.4066 3001.4270 3042.0083 3049.4837 3060.4096 3064.2070 3071.1080 3072.3187 3076.9247 3085.7338 3088.2391 3093.2170 3125.4853 3148.0022 3155.8268 3170.3033 3171.5802 3185.9158 3193.3626
redmass: 4.1070 5.1382 4.7215 9.9858 4.9701 5.7890 3.0994 6.6748 6.0244 4.6950 5.1365 4.5552 8.2925 3.4962 7.4444 4.6314 5.6554 1.1185 1.1786 2.7261 2.4606 1.2998 3.5003 4.0240 4.7029 1.1986 7.6162 2.3155 4.5957 4.7761 6.6650 2.9951 8.7950 5.1960 4.2753 5.5028 2.4776 9.5756 14.2790 5.2611 8.8163 3.0629 6.6786 3.3927 8.0678 4.0038 4.7521 2.5007 7.8554 7.7749 12.1371 9.2029 7.7573 4.7521 8.0102 2.7754 6.5651 3.2545 1.8886 2.5507 4.2752 1.5255 2.0532 3.4213 2.4882 2.4213 1.3137 1.2415 1.3414 1.4070 1.3859 1.3969 7.4632 1.8337 1.4066 1.5532 5.3525 8.3359 3.5103 6.2771 3.9607 1.6039 3.5078 2.3429 3.9158 1.8005 2.2444 1.9851 1.9101 1.8094 2.1456 1.9420 1.8983 1.3190 2.5886 1.5417 2.2109 2.0311 1.4400 2.7228 1.3291 1.1834 3.9219 1.3253 10.1778 1.2725 1.3489 1.2201 1.2114 9.8079 1.2177 1.2097 1.2932 2.5938 1.1062 2.2306 3.4202 2.6448 1.0568 1.0516 1.0587 1.0562 1.0537 1.0480 1.0555 1.0503 1.0555 6.1322 6.4002 8.4424 6.6641 9.0346 1.0679 1.0355 1.0347 1.0364 1.0363 1.0845 1.0839 1.0573 1.0932 1.0991 1.0992 1.0981 1.0988 1.0997 1.1001 1.0999 1.0989 1.1082 1.0887 1.0875 1.0948 1.0929 1.0989 1.0978
irintensity: 0.5759 0.0410 0.4702 0.0499 0.1135 0.9266 0.2909 1.6643 1.0307 0.4038 1.1845 1.0076 1.0668 1.9169 2.3950 1.7731 2.2432 0.8849 0.5260 1.3250 4.3417 0.7592 3.6070 2.6902 6.7442 0.3710 2.2363 2.1482 1.6636 3.6232 4.9254 2.6497 2.1666 1.4553 2.4487 2.3951 1.1072 0.5247 7.3334 1.0445 7.0184 6.6507 11.0087 4.0364 1.1478 1.6904 9.0719 9.9558 5.3372 0.8549 25.0491 5.1252 6.7149 72.8970 27.8465 14.1371 32.9593 6.9950 9.7718 6.0140 49.9876 29.4840 99.8474 38.0281 1.8212 3.1568 0.7718 2.2489 0.7355 15.2788 0.1753 8.1000 48.5462 18.0229 0.2221 35.0445 157.6784 136.1132 21.2232 56.4146 47.8312 23.3029 8.3629 37.7859 224.2681 23.3867 4.1828 23.6437 26.8056 18.1612 73.1028 123.5937 33.7871 12.3706 112.4227 11.2867 177.9313 71.2960 13.9002 311.4269 4.9674 2.7327 78.3840 3.5263 35.1298 5.6869 9.2968 2.1983 41.7273 21.7029 24.1819 10.3632 40.6680 189.6988 16.2446 50.9929 65.2530 10.6831 0.3324 1.3975 1.1081 7.2151 1.7461 23.4246 5.3995 6.4707 10.1645 21.4865 26.0885 112.2282 7.0117 91.4429 27.6168 24.9768 23.3568 29.9261 27.5814 5.5045 16.1882 13.1783 20.3424 3.7895 0.7495 80.9855 82.2740 78.7469 24.5259 48.8040 29.5635 3.7885 6.8596 4.9512 24.8513 1.4764 4.0995 2.1801
temp: 298.150 k
press: 1.00000 atm
elementType: 16 16 9 9 9 8 7 7 7 6 6 6 6 6 6 6 6 6 6 6 6 6 6 6 6 6 6 6 6 6 1 1 1 1 1 1 1 1 1 1 1 1 1 1 1 1 1 1 1 1 1 1 1 1
symmnumber: 1
zpe: 1084378.5 jmol-1
zpe.correction: 0.413018 hartree
zpe.thermalcorrener: 0.443767 hartree
zpe.thermalcorrenthalpy: 0.444711 hartree
zpe.thermalcorrgfe: 0.347247 hartree
zpe.sumelectzpe: -2147.529806 hartree
zpe.sumelectthermal: -2147.499057 hartree
zpe.sumelectthermalent: -2147.498113 hartree
zpe.sumelectthermalfe: -2147.595577 hartree
dipole: -3.7089 0.6788 -4.3921
dipole: 5.7886
quadrupole: -203.1812 -175.9068 -189.1716
quadrupole: 1.6843 -19.2939 1.2018
quadrupole: -13.7613 13.5131 0.2482 1.6843 -19.2939 1.2018
hfenergy: -2147.9428244 hartree
pointgroup: C01 [X(C21H24F3N3O1S2)]
dipole: -1.2915358 0.1381652 1.87066 debye
polarizability: 334.9356838|11.3273735|338.5541983|-30.5444008|-0.4524454|235.4645444 unknown
InChI: InChI=1S/C21H24F3N3OS2/c1-13(2)26(14(3)4)11-12-29-20(28)27-16-8-5-7-15(21(22,23)24)18(16)30-19-17(27)9-6-10-25-19/h5-10,13-14H,11-12H2,1-4H3
charge 0 multiplicity 1
54 atoms
S  -1.277449 1.62149 0.808624
S  2.20833 -0.881212 -1.75093
F  5.022214 2.723957 -2.081575
F  5.262089 0.482578 -1.902397
F  3.600428 1.347393 -3.182005
O  -1.643814 -1.06371 1.27465
N  -5.226581 0.590399 -0.111086
N  0.566397 -0.455207 0.78679
N  2.146657 -3.434502 -0.80042
C  -6.252003 1.31095 -0.91062
C  -5.495401 -0.807016 0.332193
C  -3.811921 0.913184 -0.343196
C  -6.36254 2.788516 -0.458341
C  -6.055696 1.231888 -2.453912
C  -6.663942 -0.874624 1.34355
C  -5.709012 -1.817167 -0.831711
C  -3.158312 1.370932 0.98078
C  1.568458 0.566233 0.581235
C  -0.801663 -0.171594 1.005199
C  2.40204 0.508943 -0.565548
C  0.981387 -1.82553 0.621386
C  3.374564 1.529006 -0.758979
C  1.74719 -2.178191 -0.519468
C  1.758422 1.572738 1.556556
C  3.512435 2.569917 0.187035
C  0.639519 -2.851221 1.530445
C  2.713571 2.585418 1.347868
C  4.293196 1.517709 -1.954151
C  1.047916 -4.173233 1.244731
C  1.787728 -4.424565 0.068196
H  -7.216896 0.821703 -0.675165
H  -4.578123 -1.121019 0.86991
H  -3.718086 1.720798 -1.090928
H  -3.242898 0.044241 -0.738499
H  -6.593495 2.843514 0.619682
H  -7.155496 3.316255 -1.020982
H  -5.412714 3.328963 -0.634696
H  -6.911397 1.703414 -2.972828
H  -5.142036 1.767879 -2.772755
H  -5.97709 0.186551 -2.797267
H  -6.486127 -0.178292 2.181601
H  -6.7639 -1.89935 1.746995
H  -7.630069 -0.609724 0.874015
H  -5.763973 -2.85031 -0.440357
H  -6.651441 -1.611898 -1.372828
H  -4.873796 -1.772075 -1.554601
H  -3.547899 2.345133 1.31893
H  -3.298103 0.616398 1.770936
H  1.140116 1.565987 2.458448
H  4.254882 3.353362 0.014603
H  0.044994 -2.619266 2.416393
H  2.841016 3.378414 2.090068
H  0.790993 -4.995821 1.918223
H  2.107422 -5.436437 -0.200696
