program: Gaussian 09
title: 000016276
version: EM64L-G09RevD.01
frameworkgroup: C1[X(C6H8O5)]
method: RPBEPBE
basis: SDD
operation: Freq
keyword: #p
keyword: freq=noraman
keyword: PBEPBE/SDD
title: #p freq=noraman PBEPBE/SDD
converged: YES YES NO NO
title: Mulliken charges:
elementType: O O O O O C C C C C C H H H H H H H H
charge: -0.257349 -0.413659 -0.413653 -0.221178 -0.221186 -0.497899 -0.497904 -0.106762 -0.106759 0.190053 0.190069 0.275799 0.246706 0.275789 0.246707 0.275720 0.275718 0.379893 0.379894
chargesum: 0.00000
title: Mulliken charges with hydrogens summed into heavy atoms:
elementType: O O O O O C C C C C C
charge: -0.257349 -0.033765 -0.033759 -0.221178 -0.221186 0.024606 0.024592 0.168958 0.168959 0.190053 0.190069
polarizability: 9.91698134e+01 4.66153399e+00 7.49996705e+01 -6.55079629e-04 -4.28051053e-03 5.66216544e+01
1716.lowfreq: -9.4192 -0.0012 -0.0010 -0.0010 3.7163 13.6056 28.1139 31.8745 50.5872
frequency: 28.1013 31.7159 50.4788 113.7016 171.1545 239.1169 292.1881 299.2594 318.4680 419.4563 537.8253 568.6167 599.5446 612.4106 671.2047 702.1307 723.5446 731.1962 796.8499 817.8118 886.4366 888.7245 929.7806 953.0618 1020.4179 1031.5721 1057.4309 1058.3485 1069.1231 1149.6203 1170.7684 1232.8208 1242.6817 1243.2653 1264.7347 1306.1526 1326.9816 1349.6546 1362.6433 1465.4677 1468.8674 1665.2090 1667.5774 3032.9753 3037.6842 3088.3064 3091.4114 3097.1144 3112.5674 3508.7982 3508.8790
redmass: 9.3837 6.1741 6.7111 5.5563 7.2863 3.5696 9.0010 2.1787 7.8716 5.8325 2.6457 4.1585 1.3325 1.3483 2.9692 4.1111 4.7156 6.2631 3.1876 3.8978 4.0877 1.9533 3.2471 2.8412 4.2198 3.1355 2.8207 1.5637 2.0909 1.1400 1.5041 1.2960 1.5176 1.5518 1.3677 1.3679 1.3084 1.7902 1.6571 1.0862 1.0953 8.8833 8.3307 1.0583 1.0621 1.0875 1.0902 1.1046 1.1058 1.0640 1.0640
irintensity: 3.6807 1.2032 4.1720 0.1743 0.1915 3.4312 0.0421 1.3236 0.0018 32.6971 37.2720 0.5660 190.5499 6.1726 29.6626 143.8318 7.0892 4.1357 3.4421 4.0171 13.4967 5.9032 3.9928 78.6660 502.0482 13.9746 178.5387 3.3263 0.5431 20.3453 2.6949 1.3941 17.7741 0.1072 3.9056 10.4573 0.4855 45.7503 3.6060 12.7017 16.8870 365.5668 0.0439 11.2505 14.0594 24.1562 0.0056 4.3781 14.0788 51.3997 0.4705
temp: 298.150 k
press: 1.00000 atm
elementType: 8 8 8 8 8 6 6 6 6 6 6 1 1 1 1 1 1 1 1
symmnumber: 1
zpe: 370925.2 jmol-1
zpe.correction: 0.141278 hartree
zpe.thermalcorrener: 0.151849 hartree
zpe.thermalcorrenthalpy: 0.152793 hartree
zpe.thermalcorrgfe: 0.102826 hartree
zpe.sumelectzpe: -608.705041 hartree
zpe.sumelectthermal: -608.694470 hartree
zpe.sumelectthermalent: -608.693526 hartree
zpe.sumelectthermalfe: -608.743493 hartree
dipole: 0.0001 0.0010 2.4550
dipole: 2.4550
quadrupole: -47.4749 -71.6527 -63.1965
quadrupole: 4.7914 -0.0008 0.0017
quadrupole: 13.2998 -10.8780 -2.4218 4.7914 -0.0008 0.0017
hfenergy: -608.8463191 hartree
pointgroup: C01 [X(C6H8O5)]
dipole: 0.0000633 -0.9658798 0.0000496 debye
dipolederiv: -0.8280349 -0.0000205 -0.0869512 -0.0000092 -0.4027875 -0.0000115 -0.2464917 -0.0000056 -0.3675967 -1.0314277 -0.1306417 -0.5549612 -0.0774568 -0.4099976 -0.036334 -0.449342 -0.0563111 -0.5703199 -1.0313427 0.1307234 -0.5549905 0.0775272 -0.4100134 0.0363746 -0.4493596 0.0563647 -0.5703643 -0.6736746 -0.0536711 0.1465902 -0.0695983 -0.3038326 -0.0309047 -0.0792109 -0.0178039 -0.9240392 -0.6737002 0.0536536 0.1466123 0.0696404 -0.3038652 0.0310075 -0.0791864 0.0179018 -0.9240218 -0.0005954 -0.0139158 -0.0415355 0.0839101 -0.0271086 -0.0091871 -0.0055811 -0.024431 -0.000378 -0.0005811 0.0139072 -0.0415478 -0.0838816 -0.0271211 0.0091827 -0.0056119 0.0244519 -0.0003851 0.4239882 -0.096771 0.1095946 -0.3537406 0.2365446 -0.0055064 0.2184255 0.0279164 0.2379152 0.423921 0.0967982 0.1095767 0.353748 0.2365859 0.005552 0.2183283 -0.0278693 0.2379716 1.4454881 0.2378009 0.2461717 0.2018544 0.175653 0.0787655 0.3029123 0.052303 1.230979 1.4454741 -0.2378497 0.2461861 -0.2019536 0.1757033 -0.0789464 0.302946 -0.0525065 1.230965 0.0256303 -0.0619576 0.0895637 -0.0628097 0.0746972 0.0039494 0.0493812 0.008869 -0.0242204 -0.0228671 0.1256377 -0.0287626 0.1099584 -0.0012947 0.0139294 -0.0115529 0.0088256 0.0971389 0.0255963 0.0619632 0.0895585 0.0628099 0.0747031 -0.0039533 0.0493768 -0.0088859 -0.0242308 -0.0228431 -0.1256407 -0.0287401 -0.1099633 -0.0013186 -0.0139218 -0.0115373 -0.0088126 0.0971422 0.0130817 -0.0051451 -0.0291955 -0.0061473 0.0632014 -0.0483677 -0.051939 -0.039556 -0.0480091 0.0130888 0.0051316 -0.0291944 0.0061319 0.0632055 0.0483495 -0.0519339 0.0395291 -0.048035 0.2344051 0.0017022 0.1060088 0.006416 0.3935209 -0.0153783 0.1501863 -0.003409 0.1847349 0.234393 -0.0017049 0.1060161 -0.006436 0.3935244 0.0154007 0.1501903 0.0034294 0.1847535 unknown
polarizability: 99.1327718|0.0003233|56.6216536|4.7564512|-0.0019475|75.0367128 unknown
InChI: InChI=1S/C6H8O5/c7-5(8)3-1-2-4(11-3)6(9)10/h3-4,7,9H,1-2H2
charge 0 multiplicity 1
19 atoms
O  -0.000025 0.904542 -0.000008
O  3.409819 0.233418 0.738874
O  -3.409741 0.233396 -0.738961
O  2.440742 0.037944 -1.366894
O  -2.440798 0.037553 1.366829
C  0.421402 -1.385603 0.651147
C  -0.421202 -1.385739 -0.650882
C  1.006213 0.052411 0.66614
C  -1.006147 0.052217 -0.666109
C  2.315287 0.116461 -0.126904
C  -2.315265 0.116286 0.126859
H  -0.224056 -1.51712 1.535107
H  1.198926 -2.167089 0.652911
H  0.224259 -1.517345 -1.534826
H  -1.198656 -2.167296 -0.652516
H  1.16791 0.444378 1.68142
H  -1.167817 0.444034 -1.681451
H  4.254614 0.237803 0.210958
H  -4.254567 0.237747 -0.211093
