program: Gaussian 09
title: 000118568
version: EM64L-G09RevD.01
frameworkgroup: C1[X(C10H9N3O2)]
method: RPBEPBE
basis: SDD
operation: Freq
keyword: #p
keyword: freq=noraman
keyword: PBEPBE/SDD
title: #p freq=noraman PBEPBE/SDD
converged: YES YES NO YES
title: Mulliken charges:
elementType: O O N N N C C C C C C C C C C H H H H H H H H H
charge: -0.272847 -0.214120 -0.500759 -0.450786 -0.065532 0.483898 -0.443628 -0.332159 0.274544 -0.197138 -0.214134 0.257430 -0.255860 -0.146265 -0.273062 0.290992 0.213739 0.305373 0.322967 0.226709 0.228293 0.230037 0.267354 0.264955
chargesum: 0.00000
title: Mulliken charges with hydrogens summed into heavy atoms:
elementType: O O N N N C C C C C C C C C C
charge: -0.272847 -0.214120 -0.209767 -0.127819 -0.065532 0.483898 -0.229890 -0.026786 0.274544 0.029571 0.014159 0.257430 -0.025823 0.121089 -0.008107
polarizability: 2.44892534e+02 -9.88282342e-01 1.30791902e+02 -5.36227556e-03 -1.45491573e-02 5.37259236e+01
1716.lowfreq: -26.0562 -0.0011 -0.0007 0.0006 3.4856 6.7353 18.7036 37.7823 60.7832
frequency: -25.2711 37.5236 60.7823 75.3865 82.8179 195.3512 230.2498 237.5640 273.9937 336.9261 357.6562 407.9058 436.7090 519.9274 555.2896 578.9722 609.8488 614.2502 668.1706 695.8424 697.7517 715.3439 729.4222 758.7086 766.4072 828.6545 840.0408 847.2621 881.6943 909.2525 915.4168 971.6337 978.1803 987.2005 1000.5783 1001.8171 1030.1297 1066.5162 1092.5238 1107.5133 1167.3087 1173.4234 1186.8497 1192.2748 1263.4231 1282.4265 1323.3761 1384.4323 1430.7857 1485.5198 1492.1496 1505.7910 1519.6879 1603.8436 1611.2409 1618.6362 1678.0921 3105.8870 3133.7748 3145.3446 3166.5820 3196.3777 3246.8111 3293.0473 3521.0245 3544.2163
redmass: 5.5967 5.9479 5.8856 5.7751 4.3934 6.1737 3.0250 7.7200 4.0458 8.7104 6.6065 2.9278 1.6033 2.6295 7.5702 2.9535 1.2523 6.4376 5.1887 2.0432 9.0732 1.4319 7.3498 7.2670 1.6904 6.0353 1.2707 1.3453 8.2108 6.0874 1.4214 1.3502 6.7418 6.4907 1.3047 7.7241 2.1202 2.5549 1.5715 1.3537 3.2536 1.0558 2.9825 1.1539 2.2833 1.5763 1.4476 6.2265 2.3380 2.4056 3.3001 2.1648 1.9013 5.0955 8.3930 6.5802 5.8204 1.0887 1.0867 1.0933 1.0998 1.0951 1.0933 1.1091 1.0766 1.0761
irintensity: 0.0009 0.6584 6.5913 0.5186 0.2757 7.5518 1.0748 0.6327 11.8165 2.0653 3.7288 0.0289 0.1907 39.5987 14.5084 12.4481 129.8799 1.4329 27.3130 61.6567 28.3558 41.5023 0.8616 13.5772 101.3256 8.7945 0.0901 13.3546 20.4921 12.8391 14.3822 0.1592 1.2101 0.5889 2.9747 10.0801 8.6020 49.5386 16.5674 82.7901 318.9219 2.6392 16.2212 0.3100 76.7896 3.8271 76.0939 98.5325 91.0164 349.3905 77.1208 498.9658 169.9238 18.1516 477.3635 15.9442 215.4193 18.4363 0.2060 29.9445 24.8188 7.7086 7.9125 0.6821 4.5706 36.1905
temp: 298.150 k
press: 1.00000 atm
elementType: 8 8 7 7 7 6 6 6 6 6 6 6 6 6 6 1 1 1 1 1 1 1 1 1
symmnumber: 1
zpe: 468777.9 jmol-1
zpe.correction: 0.178548 hartree
zpe.thermalcorrener: 0.190392 hartree
zpe.thermalcorrenthalpy: 0.191336 hartree
zpe.thermalcorrgfe: 0.139122 hartree
zpe.sumelectzpe: -700.089858 hartree
zpe.sumelectthermal: -700.078015 hartree
zpe.sumelectthermalent: -700.077070 hartree
zpe.sumelectthermalfe: -700.129284 hartree
dipole: -0.1590 -5.0204 0.0013
dipole: 5.0229
quadrupole: -65.6042 -81.5380 -92.0216
quadrupole: 3.0675 -0.0037 0.0018
quadrupole: 14.1171 -1.8167 -12.3003 3.0675 -0.0037 0.0018
hfenergy: -700.2684062 hartree
pointgroup: C01 [X(C10H9N3O2)]
dipole: 0.0508964 1.9754954 0.0005011 debye
dipolederiv: -0.5619437 0.1241608 0.0000521 -0.2562987 -0.7019177 -0.0005173 -0.0002384 -0.0004605 -0.1162519 -0.7522397 -0.0281433 -0.0000601 0.0063347 -0.8210442 -0.000016 -0.0002515 0.0000346 -0.3288009 -2.2770892 0.1153777 -0.0000626 0.5017391 -0.3298785 -0.0000409 -0.0000844 -0.00004 -0.3573293 -2.5422764 -0.0387217 -0.0000707 -0.3257882 -0.396184 0.0000578 -0.0001662 0.000043 -0.36585 -0.6426024 0.090776 -0.0000112 0.5665136 -0.4508797 -0.000138 0.0003336 -0.000195 -0.2181151 1.4994136 0.1231256 -0.0000186 0.4779747 0.055599 0.0000142 -0.0000144 -0.0000041 0.1043516 -0.3745423 -0.0305481 -0.0000007 0.1440151 0.056742 -0.0000232 -0.0000075 -0.0000208 -0.2214244 -0.3152229 -0.0256175 -0.000007 -0.289384 -0.0921861 -0.000007 0.0000293 0.0000034 -0.1662142 3.208626 -0.002481 0.0002072 0.0349067 1.2293573 -0.000002 0.0007686 -0.000021 0.3341381 0.1188674 0.0027588 -0.0000066 -0.1021224 0.1145837 -0.0000187 -0.0000035 -0.0000173 -0.1381392 0.1142474 0.0021163 -0.0000042 0.0892693 0.1695994 -0.0000211 -0.0000182 -0.000019 -0.1406741 1.9502702 -0.1823269 0.0000217 -0.6411104 0.6611944 0.0004269 -0.0000391 0.00043 0.1884194 -0.0774956 0.0499559 -0.0000095 0.0487846 -0.1496306 -0.0000032 -0.0000052 -0.0000048 -0.1885587 -0.1438549 -0.157328 -0.0000949 -0.0653836 0.228211 0.0002855 -0.0000515 0.0002818 -0.1738653 0.3256692 -0.0386134 0.0000793 -0.1432218 0.120322 0.0002088 -0.0000568 0.0001813 -0.1455947 0.133115 0.0032099 0.0000002 -0.063907 0.0749883 0.0000313 -0.0000295 0.0000361 0.3160017 0.0447086 -0.1077838 0.0000119 -0.0834014 -0.1016576 0.0000227 0.0000084 0.0000202 0.1695371 0.1655043 0.0599192 0.000001 0.0611486 0.0758994 0.000008 -0.0000017 0.0000019 0.1824006 0.1357624 0.0057978 -0.0000052 -0.001649 0.1529255 -0.0000823 -0.0001867 -0.0000815 0.3440283 -0.0280545 0.1018209 -0.0000051 0.1223407 -0.029172 0.0000127 -0.0000048 0.0000123 0.1580463 0.0554615 -0.0489069 0.0000066 -0.0807973 -0.0973989 0.0000196 0.0000086 0.0000181 0.1531684 -0.1307759 -0.0471473 0.000009 -0.0491485 0.0792088 0.0000079 0.000011 0.000008 0.1707281 0.0605625 -0.0172236 -0.0000475 -0.0544977 0.0863541 -0.0001368 -0.0000609 -0.0001176 0.2447496 0.0338895 0.0458225 0.0000148 0.1036828 0.0649643 -0.000089 0.0000611 -0.0000891 0.1952485 unknown
polarizability: 244.9002271|-0.3143705|130.7842086|0.0052763|0.0145806|53.7259236 unknown
InChI: InChI=1S/C10H9N3O2/c14-9(13-10-11-6-7-15-10)12-8-4-2-1-3-5-8/h1-7,12-13H
charge 0 multiplicity 1
24 atoms
O  3.816984 1.211181 0.000896
O  0.337374 -1.361639 -0.000196
N  -0.788847 0.717154 -0.000274
N  1.540881 0.670251 0.000027
N  3.341245 -1.048017 -0.001022
C  -2.155346 0.309001 -0.000219
C  -3.134905 1.339485 -0.000277
C  -2.564519 -1.051076 -0.000109
C  0.345794 -0.107981 -0.0002
C  -4.506788 1.01772 -0.000225
C  -3.943247 -1.35441 -0.000053
C  2.836283 0.174051 -0.000115
C  -4.921537 -0.334333 -0.00011
C  5.049035 0.496002 0.000559
C  4.750442 -0.848241 -0.000616
H  -0.650426 1.730126 -0.000452
H  -2.822657 2.392687 -0.000362
H  -1.812279 -1.841433 -0.000086
H  1.489557 1.691114 0.000528
H  -5.249473 1.823068 -0.000273
H  -4.251813 -2.405804 0.00003
H  -5.987111 -0.586196 -0.000069
H  5.95121 1.096728 0.001207
H  5.425441 -1.699441 -0.001192
