program: Gaussian 09
title: 000118917
version: EM64L-G09RevD.01
frameworkgroup: C1[X(C23H23NO4)]
method: RPBEPBE
basis: SDD
operation: Freq
keyword: #p
keyword: freq=noraman
keyword: PBEPBE/SDD
title: #p freq=noraman PBEPBE/SDD
converged: YES YES NO NO
title: Mulliken charges:
elementType: O O O O N C C C C C C C C C C C C C C C C C C C C C C C H H H H H H H H H H H H H H H H H H H H H H H
charge: -0.277117 -0.272289 -0.294164 -0.290048 -0.374573 -0.217000 0.132656 0.307586 0.248315 -0.728550 -0.384005 0.122311 -0.754471 0.122069 -0.473187 -0.473241 0.471332 0.471882 -0.371403 -0.384723 -0.368484 -0.391449 -0.229928 -0.227938 -0.229367 -0.227328 -0.233937 -0.234128 0.272130 0.236484 0.210298 0.243235 0.287157 0.304906 0.186874 0.267207 0.273144 0.217459 0.237335 0.239608 0.219959 0.267208 0.233166 0.270372 0.233168 0.226061 0.225610 0.226869 0.226159 0.228214 0.228556
chargesum: 0.00000
title: Mulliken charges with hydrogens summed into heavy atoms:
elementType: O O O O N C C C C C C C C C C C C C C C C C C C C C C C
charge: -0.277117 -0.272289 -0.294164 -0.290048 -0.069666 0.055130 0.132656 0.307586 0.248315 -0.038532 -0.096847 0.122311 -0.027247 0.122069 -0.018394 -0.013674 0.471332 0.471882 -0.104195 -0.151557 -0.098112 -0.158281 -0.003867 -0.002329 -0.002498 -0.001169 -0.005723 -0.005572
polarizability: 3.26869782e+02 -1.00575235e+01 2.95348285e+02 1.67996100e+01 -1.41953577e+01 2.01830271e+02
1716.lowfreq: -20.4602 -4.3605 -3.4556 0.0003 0.0004 0.0007 2.6664 17.8935 20.7400
frequency: -17.5710 17.7159 20.7250 21.6550 31.5576 39.1521 56.4618 65.5409 73.8789 94.2175 108.3333 117.5730 139.8085 147.2340 157.6759 192.2337 202.2860 219.0452 230.4334 240.1764 280.5089 291.9527 326.9667 334.4883 340.5307 354.8575 387.0487 397.7604 403.5762 404.0516 431.4966 443.9731 476.2071 501.6629 511.4025 538.5136 576.4667 590.4412 595.3630 602.3854 616.2423 618.2700 631.4991 649.7395 704.0452 704.6813 713.6252 717.0090 733.4440 739.7436 756.0518 758.8248 804.0366 816.5725 816.7008 858.0964 859.4740 876.1783 877.4563 913.4723 925.8767 936.3340 937.0042 970.3674 973.9362 981.9141 983.6089 989.0582 990.0661 995.0889 997.0016 999.8486 1001.5470 1026.0316 1027.6054 1032.9007 1034.9026 1059.4213 1066.7246 1090.1682 1090.3875 1127.8345 1172.9095 1172.9308 1175.1569 1188.2330 1189.3198 1213.1838 1220.2502 1221.9932 1235.0394 1236.2546 1262.3461 1301.4001 1310.9794 1312.0635 1329.3121 1331.4323 1345.8512 1350.4262 1364.0174 1374.5492 1384.7123 1385.9559 1409.1837 1439.3275 1440.8844 1442.5249 1459.4274 1461.3266 1465.0143 1467.3055 1476.6437 1478.4669 1484.4588 1485.0318 1568.2769 1587.7167 1594.5744 1595.2983 1614.1409 1615.1668 1622.9246 1665.4841 2979.7774 2987.7686 3033.3231 3034.3732 3053.6524 3078.7746 3083.9118 3089.1867 3105.0252 3105.7854 3107.8122 3119.3151 3119.5220 3127.1272 3127.2871 3139.6998 3139.8551 3150.6984 3151.0663 3164.3156 3164.3778 3169.6667 3568.8774
redmass: 4.9805 5.5989 5.4551 4.0331 4.3679 4.1121 4.7001 5.4151 4.0884 3.0728 1.6040 3.3960 4.5200 4.4963 5.2636 4.4252 2.6274 1.2304 4.7941 5.7810 6.1013 4.4843 4.5036 5.4556 3.4267 2.5677 2.6672 4.4419 2.8349 2.8396 4.0095 4.2790 3.8633 4.4528 4.1036 4.1518 1.4721 4.9638 3.8473 4.4481 6.2709 6.2775 3.7454 3.5420 1.8223 1.8946 5.4636 5.2587 6.6188 4.4943 2.1512 2.1124 3.8707 3.5017 3.4500 1.2567 1.2698 4.9176 4.5534 1.6063 2.0472 1.5537 1.5139 1.8887 1.8524 1.4252 1.4284 4.4075 4.9633 2.7567 2.5240 1.3455 1.3368 2.2535 2.2167 3.0886 1.5981 2.0614 2.2622 1.5267 1.5210 2.8330 1.0550 1.0544 2.1633 1.1289 1.1223 2.1188 2.8288 2.8227 1.1806 1.1841 4.6171 2.0882 1.2709 1.8918 1.2597 1.2524 1.3388 1.3832 1.9494 1.2637 7.9176 8.0458 1.1912 1.0573 2.1617 2.1752 1.1634 1.1461 1.1197 1.1092 1.0471 2.1052 2.2514 2.3074 7.0700 9.4388 6.1971 6.1688 6.0144 6.1003 4.6106 7.1604 1.0343 1.0398 1.0579 1.0582 1.0853 1.0978 1.0995 1.1001 1.1075 1.0964 1.1073 1.0862 1.0860 1.0875 1.0874 1.0922 1.0922 1.0963 1.0962 1.1016 1.1016 1.0943 1.0779
irintensity: 0.0793 0.0627 0.1217 0.4406 0.0598 1.0377 0.9776 0.5563 4.7777 0.2280 2.4828 0.4723 3.0202 0.0609 1.1791 0.5849 0.3298 0.5203 4.3195 5.5990 4.9543 3.1299 3.8953 3.2281 2.7388 13.2658 2.4315 5.2857 0.1211 0.2578 3.2252 2.6920 6.9037 19.5254 19.3312 18.1376 53.7818 14.9346 12.5587 19.7947 0.6338 0.6433 6.6624 16.9726 61.5344 44.2810 25.8707 5.8403 9.3510 0.3812 76.7368 35.7624 8.8441 4.1587 13.8980 0.6922 1.1975 18.6762 58.0389 41.7782 65.1031 0.3417 1.6823 20.6108 2.2348 2.2555 2.3698 41.8283 10.2706 136.5972 187.9496 1.3300 1.8543 31.0376 10.5094 312.6273 46.9632 75.8086 25.4895 25.5903 1.8673 130.5858 0.7393 0.2767 121.2796 0.8216 1.9824 197.4966 13.4424 18.0844 37.1633 4.5521 288.5205 6.9986 3.4813 11.1762 1.8914 2.5436 35.8372 23.5911 5.0636 16.9244 0.7776 0.7854 60.8327 31.3739 9.4564 8.6581 108.5821 21.5781 24.4474 27.2966 10.8374 361.8836 4.3182 8.3138 541.0742 63.6015 6.8613 1.1815 0.3117 0.8584 34.2333 179.9408 22.1234 35.2852 41.3753 36.0530 1.5468 20.5758 21.6945 19.7429 5.9278 5.5949 5.4709 5.5440 4.3048 2.2483 1.8425 23.3385 20.2786 24.8282 24.3751 33.2405 15.3386 0.7212 61.7964
temp: 298.150 k
press: 1.00000 atm
elementType: 8 8 8 8 7 6 6 6 6 6 6 6 6 6 6 6 6 6 6 6 6 6 6 6 6 6 6 6 1 1 1 1 1 1 1 1 1 1 1 1 1 1 1 1 1 1 1 1 1 1 1
symmnumber: 1
zpe: 1068389.9 jmol-1
zpe.correction: 0.406928 hartree
zpe.thermalcorrener: 0.432170 hartree
zpe.thermalcorrenthalpy: 0.433114 hartree
zpe.thermalcorrgfe: 0.348462 hartree
zpe.sumelectzpe: -1243.893941 hartree
zpe.sumelectthermal: -1243.868699 hartree
zpe.sumelectthermalent: -1243.867755 hartree
zpe.sumelectthermalfe: -1243.952407 hartree
dipole: -0.2092 1.2207 0.1685
dipole: 1.2499
quadrupole: -164.3451 -130.9358 -163.3343
quadrupole: -2.5817 12.9474 -3.6999
quadrupole: -11.4734 21.9360 -10.4626 -2.5817 12.9474 -3.6999
hfenergy: -1244.300869 hartree
pointgroup: C01 [X(C23H23N1O4)]
dipole: -0.4816962 -0.0389432 -0.0910346 debye
polarizability: 304.4722427|-6.7793097|284.5018535|-25.2532178|53.4218183|235.0742411 unknown
InChI: InChI=1S/C23H23NO4/c1-16-20(22(25)27-14-18-9-5-3-6-10-18)13-24-17(2)21(16)23(26)28-15-19-11-7-4-8-12-19/h3-13,16,24H,14-15H2,1-2H3
charge 0 multiplicity 1
51 atoms
O  -0.501272 2.51862 -0.08255
O  1.092233 -2.033454 -0.02998
O  -2.722382 3.111553 0.347885
O  -0.358301 -3.839655 0.325599
N  -3.59717 -1.114773 0.054461
C  -0.940301 -0.151247 -0.458918
C  -2.110492 0.768703 -0.063441
C  -1.242964 -1.594184 -0.057406
C  -3.399927 0.276986 0.08428
C  -0.659096 -0.062394 -1.989797
C  -2.538551 -2.017528 0.095362
C  -1.868258 2.211018 0.093262
C  -4.655015 1.084923 0.332539
C  -0.184281 -2.608341 0.097556
C  -0.119571 3.959576 0.108189
C  2.259531 -2.970777 0.116201
C  0.291045 4.242202 1.537685
C  2.717175 -3.496964 -1.227225
C  -0.673708 4.64684 2.496642
C  1.645587 4.108436 1.935219
C  2.118115 -4.654916 -1.788627
C  3.752598 -2.840717 -1.939689
C  -0.288439 4.908004 3.830195
C  2.032378 4.368971 3.268752
C  2.547085 -5.142351 -3.042757
C  4.183266 -3.327996 -3.194023
C  1.064901 4.770031 4.219493
C  3.58069 -4.481336 -3.748072
H  -0.029175 0.189029 0.059282
H  -0.419279 0.977988 -2.271256
H  -1.538662 -0.393744 -2.571796
H  0.201152 -0.7022 -2.255781
H  -2.776768 -3.06636 0.293336
H  -4.549703 -1.462756 0.16188
H  -5.554689 0.442961 0.281806
H  -4.620763 1.571114 1.322933
H  -4.751041 1.905506 -0.395259
H  0.723051 4.08559 -0.590512
H  -0.97766 4.58193 -0.198527
H  1.95355 -3.78849 0.791162
H  3.027173 -2.3393 0.59113
H  -1.72133 4.740207 2.189176
H  2.396044 3.795901 1.198514
H  1.311911 -5.15537 -1.240326
H  4.220126 -1.945456 -1.511146
H  -1.039867 5.220617 4.564017
H  3.081971 4.26351 3.56556
H  2.079425 -6.037131 -3.468759
H  4.985375 -2.814001 -3.735545
H  1.363628 4.974908 5.253913
H  3.914455 -4.862479 -4.719938
