program: Gaussian 09
title: 000118527
version: EM64L-G09RevD.01
frameworkgroup: C1[X(C12H20NO2)]
method: RPBEPBE
basis: SDD
operation: Freq
keyword: #p
keyword: freq=noraman
keyword: PBEPBE/SDD
title: #p freq=noraman PBEPBE/SDD
converged: YES YES NO NO
title: Mulliken charges:
elementType: O O N C C C C C C C C C C C C H H H H H H H H H H H H H H H H H H H H
charge: -0.477105 -0.476381 -0.092511 -0.552260 -0.292671 -0.316975 -0.631071 0.460287 -0.357488 -0.331065 -0.381708 -0.380212 -0.229074 -0.233380 -0.216680 0.302272 0.268723 0.248862 0.296001 0.255269 0.291705 0.264371 0.307752 0.320125 0.227018 0.243350 0.213998 0.242957 0.252241 0.232218 0.390692 0.390494 0.252060 0.251138 0.257046
chargesum: 1.00000
title: Mulliken charges with hydrogens summed into heavy atoms:
elementType: O O N C C C C C C C C C C C C
charge: -0.086414 -0.085886 -0.092511 0.018735 0.252192 0.229999 0.261177 0.460287 0.112880 0.125890 -0.129467 -0.147994 0.022987 0.017758 0.040366
polarizability: 1.70304322e+02 -9.93086440e+00 1.22223566e+02 -8.21216400e+00 -1.50831851e+01 1.20020819e+02
1716.lowfreq: -12.6312 -6.4588 -0.0008 -0.0003 0.0007 6.9580 38.0135 48.2882 64.5440
frequency: 37.9379 48.2125 64.5097 92.4529 98.8720 176.7735 181.6600 202.7878 222.3449 250.0580 283.5473 298.5631 308.2972 315.8967 332.8327 340.8083 394.4450 399.5944 409.2786 421.7019 472.1889 518.7332 564.3473 603.3578 617.0996 669.6910 709.5789 765.1242 812.1199 827.9840 834.7519 859.5754 868.1117 879.0444 896.3914 942.7152 957.9114 981.4365 987.2579 991.1208 1012.4977 1013.3706 1027.9355 1055.7244 1061.8621 1091.4136 1098.5541 1107.4290 1172.5436 1179.3135 1183.5040 1195.6787 1197.6480 1198.8440 1221.6917 1244.4890 1252.5148 1266.2272 1299.6427 1321.6475 1337.8963 1357.7114 1378.2542 1379.9864 1388.9239 1415.5026 1422.6336 1440.0878 1444.9552 1452.2167 1457.2051 1468.6040 1483.6239 1485.5767 1490.5618 1494.1148 1499.5950 1591.9056 1610.2752 2970.1550 2972.8989 3014.9837 3017.2020 3024.0989 3028.6843 3030.5071 3039.1563 3102.4011 3106.8184 3117.0925 3119.6839 3128.1983 3150.0404 3151.4361 3161.0463 3161.8689 3177.9922 3591.2976 3591.4803
redmass: 3.9543 5.0041 4.9673 3.7941 3.8168 3.5984 3.3000 3.6844 2.9261 2.8774 1.4388 1.9163 1.4014 1.5378 1.9437 1.7343 2.2363 2.4495 2.7842 1.9843 3.4866 2.7559 2.5067 4.3562 6.2597 3.2625 1.8430 1.7733 3.2728 3.0006 2.2107 1.3247 2.4020 2.2588 2.7639 1.4725 1.9458 2.7915 1.4225 5.7771 1.9072 1.3518 2.2308 2.2283 3.1619 1.7414 1.9909 1.7449 1.3014 1.4100 1.0549 1.1081 1.1009 1.1354 2.7559 1.1841 1.2223 1.3142 1.1499 1.2083 1.2506 1.3083 1.2704 1.4129 4.9509 1.3082 1.3706 1.2210 1.9388 1.0911 1.0998 1.1128 1.5060 1.3573 1.0790 1.0681 1.0650 5.8392 6.0115 1.0568 1.0571 1.0982 1.0938 1.0670 1.0701 1.0322 1.0632 1.1069 1.1055 1.0905 1.1038 1.0896 1.0902 1.1039 1.1074 1.0953 1.1014 1.0671 1.0671
irintensity: 0.4577 2.2059 1.2295 4.1379 0.3548 1.8888 3.8318 0.3993 9.5434 10.3668 1.0269 4.4797 148.5169 80.5178 47.2687 82.8415 1.7102 2.9707 0.4926 1.7804 18.9011 9.5190 9.9064 4.7457 0.0325 10.0681 49.8541 78.5102 6.3191 22.5935 4.2678 6.7073 43.3107 20.5023 28.8054 0.5316 4.1279 29.7576 0.4540 3.1934 39.4432 1.5384 1.8488 16.1732 68.3768 13.6563 0.5907 3.9948 2.3685 1.1473 0.0235 8.4386 25.5178 10.0661 30.1407 12.7054 4.5348 15.7079 3.0613 10.0037 0.1263 11.3813 3.4355 7.9835 3.1101 17.0738 6.2288 25.1311 3.1117 23.8749 10.5721 12.9548 30.2327 6.4304 9.9393 23.9431 6.8555 2.5531 2.9169 41.5342 26.7531 28.2090 13.7543 19.4321 23.7904 4.9216 10.1718 2.1866 2.7952 8.8471 9.7468 6.8518 2.1455 7.6682 8.3666 12.1983 7.1264 31.0001 29.0347
temp: 298.150 k
press: 1.00000 atm
elementType: 8 8 7 6 6 6 6 6 6 6 6 6 6 6 6 1 1 1 1 1 1 1 1 1 1 1 1 1 1 1 1 1 1 1 1
symmnumber: 1
zpe: 802086.1 jmol-1
zpe.correction: 0.305498 hartree
zpe.thermalcorrener: 0.321182 hartree
zpe.thermalcorrenthalpy: 0.322126 hartree
zpe.thermalcorrgfe: 0.262710 hartree
zpe.sumelectzpe: -673.028246 hartree
zpe.sumelectthermal: -673.012562 hartree
zpe.sumelectthermalent: -673.011618 hartree
zpe.sumelectthermalfe: -673.071035 hartree
dipole: 4.6479 0.9237 -2.3305
dipole: 5.2809
quadrupole: -51.2512 -61.8147 -80.8248
quadrupole: -1.8619 -6.8039 -1.9021
quadrupole: 13.3790 2.8156 -16.1945 -1.8619 -6.8039 -1.9021
hfenergy: -673.3337441 hartree
pointgroup: C01 [X(C12H20N1O2)]
dipole: -1.8692204 0.3713081 0.8275094 debye
polarizability: 172.0730297|6.3671105|117.5498834|-2.722733|15.8197243|122.9257938 unknown
InChI: InChI=1S/C12H20NO2/c1-13(7-9-14,8-10-15)11-12-5-3-2-4-6-12/h2-6,14-15H,7-11H2,1H3
charge 1 multiplicity 1
35 atoms
O  -2.635689 -2.409223 -0.988768
O  -2.36113 2.612659 -1.082612
N  -1.147439 0.03548 -0.120464
C  -0.113843 -0.99383 0.478658
C  -2.577473 -0.353208 0.325396
C  -0.809326 1.451243 0.406545
C  -1.054626 0.026954 -1.655501
C  1.344026 -0.647484 0.267579
C  -2.911442 -1.849146 0.334705
C  -1.917774 2.506154 0.306927
C  2.029265 -1.096371 -0.893882
C  2.071748 0.056267 1.26429
C  3.401101 -0.814491 -1.071141
C  3.444244 0.335898 1.089523
C  4.109555 -0.092237 -0.082942
H  -0.371599 -1.947638 -0.008957
H  -0.357298 -1.049016 1.554226
H  -2.7089 0.022203 1.356262
H  -3.257932 0.191943 -0.348193
H  -0.541338 1.341262 1.471953
H  0.084508 1.776606 -0.147103
H  -0.012267 0.238712 -1.933452
H  -1.374411 -0.96348 -2.00666
H  -1.710846 0.822697 -2.03339
H  -2.344554 -2.389731 1.118739
H  -3.988486 -1.915517 0.592637
H  -2.77015 2.269901 0.975445
H  -1.46243 3.45185 0.666976
H  1.498356 -1.687726 -1.649907
H  1.576042 0.364274 2.193961
H  -3.064528 -3.29428 -1.093976
H  -2.88975 3.436841 -1.22265
H  3.919425 -1.169682 -1.967434
H  3.996389 0.871244 1.868529
H  5.175473 0.118775 -0.216318
