program: Gaussian 09
title: 000118686
version: EM64L-G09RevD.01
frameworkgroup: C1[X(C8H10F9NO3S)]
method: RPBEPBE
basis: SDD
operation: Freq
keyword: #p
keyword: freq=noraman
keyword: PBEPBE/SDD
title: #p freq=noraman PBEPBE/SDD
converged: YES YES NO NO
title: Mulliken charges:
elementType: S F F F F F F F F F O O O N C C C C C C C C H H H H H H H H H H
charge: 1.023281 -0.140826 -0.117736 -0.123779 -0.134092 -0.127520 -0.118556 -0.122705 -0.129211 -0.123461 -0.491452 -0.490602 -0.431630 -0.363598 0.125630 0.281326 0.235845 -0.357396 -0.325366 0.375564 -0.303548 -0.646418 0.254136 0.245779 0.237542 0.261635 0.229918 0.231963 0.240599 0.225299 0.230715 0.348667
chargesum: 0.00000
title: Mulliken charges with hydrogens summed into heavy atoms:
elementType: S F F F F F F F F F O O O N C C C C C C C C
charge: 1.023281 -0.140826 -0.117736 -0.123779 -0.134092 -0.127520 -0.118556 -0.122705 -0.129211 -0.123461 -0.491452 -0.490602 -0.082963 -0.363598 0.125630 0.281326 0.235845 0.142518 0.173811 0.375564 0.158333 0.050195
polarizability: 1.93219618e+02 3.09451470e+00 1.38168420e+02 -3.61167340e+00 2.94730492e+00 1.20301491e+02
1716.lowfreq: -9.4078 -6.1008 0.0003 0.0011 0.0012 5.1632 9.5347 18.6602 30.8383
frequency: 4.9944 18.6222 30.6214 39.1340 52.1238 58.9298 75.1292 83.8709 90.0651 94.2186 121.7704 126.8447 142.1527 154.6710 179.3581 191.6611 207.1023 216.6011 224.7272 245.1375 252.7133 261.1406 276.6146 281.2481 283.3125 296.4185 314.1642 315.2598 318.8798 329.7808 341.4723 391.0543 397.7239 422.2553 433.2381 451.5011 463.4326 505.9985 546.3942 555.2536 577.9193 583.3542 653.3567 765.2039 773.7565 800.6546 829.6966 861.6210 876.1887 949.8753 962.5598 970.6313 980.8543 986.9930 1023.6419 1028.1063 1038.0671 1043.8589 1049.9155 1067.2758 1074.6106 1082.3876 1120.4057 1126.1961 1167.6799 1175.6898 1189.2784 1211.8404 1281.6649 1308.8814 1313.1630 1350.2682 1358.8829 1376.8568 1389.8709 1447.7497 1468.4976 1470.0010 1476.5810 1484.8274 2979.4587 2987.9739 2993.3612 3006.3211 3053.6323 3061.0459 3090.0646 3106.5889 3109.2239 3572.3813
redmass: 9.7518 10.4998 9.0785 13.0583 4.2826 5.5327 11.0736 5.1228 2.2392 4.1190 10.1507 4.6486 14.7051 16.6088 14.3177 3.1675 14.8711 11.9451 10.0951 13.4955 2.0987 2.9285 12.9259 8.3995 2.6938 18.0595 3.0111 1.9407 4.3869 17.2031 3.5790 16.4867 18.6769 17.1131 5.2588 4.8164 17.4741 16.3797 14.7615 13.8277 4.6279 11.4036 17.1551 2.8726 2.0043 1.2698 15.0087 2.1662 10.7400 12.5688 4.9502 7.1367 4.2487 4.3015 13.4736 4.7501 11.6583 1.7417 7.2065 2.3783 12.4932 12.8582 1.7210 6.3766 7.8398 3.1530 12.3300 1.7051 1.2202 1.1868 1.1093 1.2064 1.2383 1.2164 1.1986 1.0701 1.0510 1.0598 1.0756 1.0611 1.0627 1.0592 1.0356 1.0653 1.1015 1.0993 1.0993 1.1030 1.1019 1.0667
irintensity: 0.2334 0.2600 0.0764 0.0382 1.9386 3.7006 0.1141 4.9128 3.6987 1.8030 0.6733 2.2018 0.5851 0.7710 0.8121 0.5795 7.5302 2.2427 5.8953 0.5431 5.3813 1.5544 0.1808 3.2791 12.7723 0.6578 63.7904 95.7487 2.7937 1.0175 9.9151 70.9074 22.2868 14.6423 44.3202 20.4875 11.3786 2.0417 2.4399 7.7704 23.8224 13.2347 29.7845 46.3082 30.9309 16.6085 83.2023 1.6401 134.2131 61.5858 59.5693 64.4831 38.6172 70.0585 76.7423 61.3188 92.3389 23.1021 41.0527 21.7148 275.9113 242.8773 37.7977 140.7972 92.2671 35.9979 48.9442 21.3840 6.3286 11.3713 0.8195 11.1668 4.0923 1.7681 12.0510 7.4710 21.2811 15.6930 10.2234 9.7276 27.6352 7.0566 22.5291 29.1386 3.6164 1.9778 25.4313 17.4369 21.7397 20.1835
temp: 298.150 k
press: 1.00000 atm
elementType: 16 9 9 9 9 9 9 9 9 9 8 8 8 7 6 6 6 6 6 6 6 6 1 1 1 1 1 1 1 1 1 1
symmnumber: 1
zpe: 505150.1 jmol-1
zpe.correction: 0.192402 hartree
zpe.thermalcorrener: 0.218000 hartree
zpe.thermalcorrenthalpy: 0.218944 hartree
zpe.thermalcorrgfe: 0.133120 hartree
zpe.sumelectzpe: -1885.914020 hartree
zpe.sumelectthermal: -1885.888421 hartree
zpe.sumelectthermalent: -1885.887477 hartree
zpe.sumelectthermalfe: -1885.973301 hartree
dipole: 3.2719 -0.7226 2.2505
dipole: 4.0364
quadrupole: -134.6357 -132.3557 -141.8914
quadrupole: -9.4327 0.2067 -0.4735
quadrupole: 1.6585 3.9386 -5.5971 -9.4327 0.2067 -0.4735
hfenergy: -1886.1064211 hartree
pointgroup: C01 [X(C8H10F9N1O3S1)]
dipole: 1.253803 0.3013719 -0.9268095 debye
polarizability: 192.932713|-5.8226554|137.9425813|-0.4686332|4.6841672|120.8142354 unknown
InChI: InChI=1S/C4F9.C4H10NO3S/c5-1(6)2(7,8)3(9,10)4(11,12)13;1-2-5(3-4-6)9(7)8/h;6H,2-4H2,1H3
charge 0 multiplicity 1
32 atoms
S  1.080044 -0.078177 0.850856
F  0.406373 0.908122 -1.731715
F  -0.642939 -1.065781 -1.276239
F  -1.26361 2.281625 -0.012015
F  -2.349933 1.228852 -1.723146
F  -3.752347 1.351733 0.605945
F  -2.074408 0.35982 1.805951
F  -2.425402 -2.011459 0.583466
F  -3.681994 -1.133766 -1.096313
F  -4.471493 -1.153119 1.028702
O  0.949889 -1.658718 1.171073
O  0.863442 1.080714 1.955005
O  4.666501 -2.800213 -1.144426
N  2.690332 0.181123 0.079839
C  -0.361664 0.211997 -0.773898
C  -1.654613 1.009621 -0.494405
C  -2.691424 0.422727 0.536451
C  3.133802 -0.889161 -0.844711
C  3.119136 1.590419 -0.114001
C  -3.322093 -0.992667 0.249766
C  4.155367 -1.836314 -0.165486
C  4.619092 1.742588 0.20721
H  3.591415 -0.420712 -1.736023
H  2.269814 -1.48745 -1.194943
H  2.906251 1.918034 -1.151249
H  2.528604 2.216366 0.578638
H  3.685733 -2.328768 0.708048
H  5.036639 -1.269113 0.172131
H  4.82852 1.442145 1.247299
H  5.246546 1.137633 -0.470747
H  4.909108 2.801395 0.080272
H  4.000909 -3.519598 -1.284538
