program: Gaussian 09
title: 000118727
version: EM64L-G09RevD.01
frameworkgroup: C1[X(C21H15NO4S)]
method: RPBEPBE
basis: SDD
operation: Freq
keyword: #p
keyword: freq=noraman
keyword: PBEPBE/SDD
title: #p freq=noraman PBEPBE/SDD
converged: YES YES NO NO
title: Mulliken charges:
elementType: S O O O O N C C C C C C C C C C C C C C C C C C C C C H H H H H H H H H H H H H H H
charge: 0.219262 -0.330176 -0.363069 -0.304585 -0.180191 -0.647587 0.236703 0.215916 0.271280 0.254520 -0.126790 0.053264 -0.219027 0.125982 0.199881 -0.570153 -0.381572 -0.383833 -0.232579 -0.229172 0.351991 -0.358049 -0.406019 -0.197953 -0.123082 -0.232847 -0.863407 0.261326 0.289259 0.291571 0.234967 0.235122 0.334902 0.387614 0.356344 0.273879 0.261192 0.249180 0.245076 0.267728 0.265923 0.267209
chargesum: 0.00000
title: Mulliken charges with hydrogens summed into heavy atoms:
elementType: S O O O O N C C C C C C C C C C C C C C C C C C C C C
charge: 0.219262 -0.330176 -0.006725 -0.304585 -0.180191 0.074929 0.236703 0.215916 0.271280 0.254520 -0.126790 0.053264 -0.219027 0.125982 0.199881 -0.308827 -0.092313 -0.092262 0.002387 0.005950 0.351991 -0.084170 -0.144827 0.051227 0.121994 -0.232847 -0.062547
polarizability: 5.50211741e+02 1.93272867e+00 2.53775021e+02 -1.77516576e+01 7.93522061e+00 1.42950011e+02
1716.lowfreq: -7.0851 -4.7193 -0.0020 -0.0015 -0.0013 1.5925 11.3755 18.5189 36.4341
frequency: 11.1491 18.3704 36.4092 41.8421 47.3649 62.9932 106.1615 113.2838 136.9201 141.6980 160.3049 178.6597 202.9743 217.4551 222.8378 263.6978 284.2986 300.4267 303.3074 330.3325 360.8951 361.9285 377.0668 390.6143 395.9876 410.1732 414.8027 422.2232 438.2499 443.0203 451.4665 486.8648 496.3913 504.7594 519.7307 560.2375 589.5427 607.9926 626.5840 631.0049 645.9228 671.8479 677.9982 689.1492 705.5896 721.5219 732.1904 743.3807 793.7588 810.7981 819.9887 820.7392 825.6078 832.0172 842.0768 864.7694 879.3111 925.6904 936.1994 943.2948 962.0527 967.1470 988.1996 993.2687 997.7366 1002.9632 1013.7655 1030.6566 1070.1600 1081.5082 1094.6876 1113.7598 1139.6075 1160.8390 1170.5602 1173.2159 1186.0116 1201.1114 1244.0814 1266.2895 1286.7466 1293.1480 1312.8099 1344.7789 1349.4177 1359.0021 1388.3684 1396.2878 1405.1121 1410.2203 1443.2256 1454.2118 1455.0926 1460.8611 1469.8271 1472.7364 1519.6228 1535.7092 1549.4262 1572.4956 1579.6967 1592.6196 1602.1658 1610.8097 1630.3954 3008.0010 3125.2806 3132.1346 3132.4062 3135.9931 3139.9687 3149.5645 3152.5792 3162.7920 3163.6818 3170.9414 3173.1230 3296.4970 3526.0636 3622.6984
redmass: 5.0881 5.0819 7.3430 7.2425 3.5484 7.0232 5.3678 6.4894 6.1537 5.3997 7.5898 4.9380 5.5726 4.0353 1.2223 4.6776 5.6405 6.4213 5.5868 5.1394 1.2074 8.6824 6.3311 7.4657 6.1430 2.9673 8.3133 3.5758 5.7952 7.4277 5.7819 6.5453 4.0221 3.4620 5.8128 1.2154 5.7873 6.8051 5.5270 6.8652 6.6703 6.8493 5.7509 5.6821 4.8086 5.4779 3.5818 2.9517 4.7578 1.8854 1.1403 1.3094 1.7629 5.4508 1.4761 2.6904 7.6291 4.9726 1.9962 1.3783 1.3305 1.1924 1.6087 2.9242 1.3883 2.7019 1.3581 2.1031 3.5306 3.1763 2.5504 1.3264 1.8408 1.5582 1.1804 1.4999 1.9059 2.1009 1.7625 2.3900 3.6939 1.2677 3.8324 3.7804 1.2534 3.9655 8.6600 7.4177 3.8160 3.3453 2.7866 4.0479 1.0523 1.1361 2.7082 1.9841 8.6844 4.9833 2.1220 5.2382 6.9868 5.5610 6.2556 6.7407 7.7911 1.0292 1.1064 1.0913 1.0862 1.1018 1.0887 1.0905 1.0879 1.0944 1.0966 1.0994 1.0970 1.0605 1.0657 1.0908
irintensity: 0.2240 0.5838 0.7411 7.1770 0.9275 0.6214 1.6999 0.3734 0.3793 0.2338 0.0514 3.0554 0.5212 3.7807 0.8002 6.8951 3.0128 3.2375 0.4633 2.7251 79.6802 7.6949 13.7848 3.4634 5.0096 0.8208 39.3323 0.5629 7.4446 15.8453 10.9593 7.8848 11.0809 1.7972 2.9696 152.5887 0.2892 25.3905 17.1278 8.3692 12.4559 2.9549 2.2260 0.7447 4.0640 4.4878 8.7342 24.2603 6.5263 72.7303 91.1235 7.2261 48.9000 62.4403 15.9113 0.0388 13.4102 30.9176 0.1036 5.3303 1.6428 7.1765 33.8298 28.2906 4.9457 35.6204 0.0497 27.7670 133.8348 37.4839 115.7392 9.2529 27.1693 48.1958 4.3638 200.9855 26.7585 330.3170 80.2304 209.6434 556.7551 8.2809 305.5247 70.4388 1.6313 5.7192 22.3154 52.9430 6.2273 90.7859 8.4507 130.9139 16.9241 117.1794 3.7384 195.1821 2.0849 701.3412 15.4034 49.4382 3.0597 13.2659 2.3257 1.2694 7.1383 25.6032 16.9892 5.0299 4.8293 8.0761 7.1672 13.9489 8.1192 3.7224 4.8664 38.4267 3.2970 67.3853 28.8963 123.3160
temp: 298.150 k
press: 1.00000 atm
elementType: 16 8 8 8 8 7 6 6 6 6 6 6 6 6 6 6 6 6 6 6 6 6 6 6 6 6 6 1 1 1 1 1 1 1 1 1 1 1 1 1 1 1
symmnumber: 1
zpe: 807455.4 jmol-1
zpe.correction: 0.307544 hartree
zpe.thermalcorrener: 0.330705 hartree
zpe.thermalcorrenthalpy: 0.331649 hartree
zpe.thermalcorrgfe: 0.252661 hartree
zpe.sumelectzpe: -1561.094917 hartree
zpe.sumelectthermal: -1561.071755 hartree
zpe.sumelectthermalent: -1561.070811 hartree
zpe.sumelectthermalfe: -1561.149800 hartree
dipole: 6.5152 -1.6774 -1.1503
dipole: 6.8253
quadrupole: -124.8507 -171.2547 -161.1121
quadrupole: 4.8551 -14.3004 2.6349
quadrupole: 27.5551 -18.8488 -8.7063 4.8551 -14.3004 2.6349
hfenergy: -1561.4024608 hartree
pointgroup: C01 [X(C21H15N1O4S1)]
dipole: 2.6378524 0.3331246 0.3761287 debye
polarizability: 547.6258654|-29.7866956|250.0188266|-10.0695553|28.8458127|149.2920809 unknown
InChI: InChI=1S/C21H15NO4S/c1-27-12-8-6-11(7-9-12)26-16-10-15(23)17-18(19(16)22)21(25)14-5-3-2-4-13(14)20(17)24/h2-10,23H,22H2,1H3
charge 0 multiplicity 1
42 atoms
S  7.317124 -1.412254 -1.595283
O  2.019577 1.024041 0.10197
O  -0.732391 -3.012991 -0.366816
O  -2.731155 2.756917 0.326358
O  -3.357029 -2.702641 -0.336697
N  -0.152967 2.548399 0.275772
C  -1.661636 0.599296 0.057075
C  -1.810833 -0.834621 -0.114329
C  -4.191493 0.866195 0.103635
C  -4.346919 -0.535912 -0.066971
C  -2.839697 1.475943 0.170653
C  -0.358064 1.202192 0.115622
C  -3.16422 -1.451964 -0.183713
C  -0.63591 -1.628359 -0.212335
C  0.790494 0.342852 -0.001145
C  0.658061 -1.032607 -0.155798
C  -5.336673 1.697714 0.209776
C  -5.649282 -1.092298 -0.129739
C  -6.625787 1.137287 0.146655
C  -6.782461 -0.263679 -0.023966
C  3.236291 0.38215 -0.278608
C  3.428588 -0.10018 -1.593464
C  4.277213 0.347155 0.666687
C  4.679811 -0.637186 -1.951532
C  5.533058 -0.187944 0.300546
C  5.74111 -0.688361 -1.007185
C  8.428398 -1.242022 -0.093833
H  1.554539 -1.659949 -0.226934
H  -5.181693 2.773028 0.339695
H  -5.736509 -2.175286 -0.26163
H  -7.508505 1.780753 0.228696
H  -7.786433 -0.69932 -0.073174
H  0.800845 2.903302 0.306551
H  -1.002505 3.131121 0.35615
H  0.174001 -3.414603 -0.413945
H  2.619029 -0.044718 -2.328152
H  4.104518 0.737921 1.673857
H  4.834897 -1.006721 -2.971121
H  6.3331 -0.20736 1.046106
H  8.55062 -0.183339 0.183365
H  8.037575 -1.829126 0.751831
H  9.400614 -1.653122 -0.40593
