program: Gaussian 09
title: 000118317
version: EM64L-G09RevD.01
frameworkgroup: C1[X(C11H15N3O)]
method: RPBEPBE
basis: SDD
operation: Freq
keyword: #p
keyword: freq=noraman
keyword: PBEPBE/SDD
title: #p freq=noraman PBEPBE/SDD
converged: NO YES NO NO
title: Mulliken charges:
elementType: O N N N C C C C C C C C C C C H H H H H H H H H H H H H H H
charge: -0.250511 -0.391239 -0.298295 -0.449585 -0.181794 -0.433614 -0.374469 -0.378267 0.109379 0.495248 -0.454845 -0.355836 -0.196593 -0.215945 -0.257092 0.257575 0.253945 0.191837 0.205832 0.209537 0.191765 0.212180 0.278242 0.276150 0.349118 0.225092 0.305299 0.224097 0.225590 0.227197
chargesum: 0.00000
title: Mulliken charges with hydrogens summed into heavy atoms:
elementType: O N N N C C C C C C C C C C C
charge: -0.250511 -0.112996 -0.022145 -0.100467 0.075781 0.012168 0.040901 0.025678 0.109379 0.495248 -0.229753 -0.050538 0.027504 0.009646 -0.029895
polarizability: 2.04288244e+02 4.52946262e+00 1.41366994e+02 -6.94116379e+00 -2.31312378e+00 8.51585886e+01
1716.lowfreq: -17.6260 -0.0005 0.0002 0.0006 6.5166 9.6760 44.0315 47.7118 72.6318
frequency: 43.3514 47.5774 72.5853 94.7856 148.0647 199.8391 219.7629 241.8997 289.3848 325.8681 344.3582 393.9534 409.2888 430.8451 491.7652 509.1607 518.7158 546.2501 614.4677 637.4637 677.3715 698.0956 729.1660 758.0377 770.9614 832.7113 840.9494 843.4144 876.5463 890.6222 921.1570 942.6273 959.4720 973.9390 977.0965 985.5910 1000.9789 1027.7361 1054.4024 1083.5765 1088.7021 1107.3324 1122.2848 1160.3471 1171.5187 1186.6836 1192.0457 1201.5131 1235.6569 1250.6661 1259.3999 1284.9435 1313.4077 1321.6268 1323.6391 1361.4715 1384.5449 1386.9759 1427.7425 1434.3431 1453.8746 1457.8314 1465.8473 1467.8597 1484.9932 1517.5995 1595.5882 1615.1952 1622.6438 2869.1533 2876.6000 2930.2474 2966.4718 3043.2055 3052.7364 3070.9680 3115.2307 3130.7947 3143.4534 3163.6089 3188.6139 3332.8326 3404.0571 3474.0843
redmass: 3.5657 4.5701 3.8202 6.3497 4.0944 4.5629 4.0077 2.2015 4.8235 6.6064 2.6182 3.1148 2.9354 2.8602 3.1142 2.9514 2.9111 2.5751 6.4259 2.1935 3.6837 1.8894 3.5671 1.7944 1.7833 2.5478 2.6598 1.4248 2.2875 1.2808 1.4504 3.0323 2.1520 1.4003 2.6925 5.7571 1.3052 2.0865 1.8767 1.8583 1.5661 2.2588 2.6986 3.8518 1.0506 1.1170 1.3432 2.0547 1.3362 1.3549 1.9390 1.2716 1.2927 1.2439 1.3450 1.3413 3.3158 1.8278 1.3046 2.2871 1.1794 1.1689 1.1307 1.1109 2.2020 2.3194 5.5931 5.7070 7.0111 1.0707 1.0696 1.0671 1.0834 1.0950 1.0897 1.0904 1.0876 1.0871 1.0937 1.0997 1.0956 1.0768 1.0741 1.0757
irintensity: 0.0451 0.6758 0.6874 2.3100 1.8818 6.7097 5.9898 6.8602 0.9242 3.3504 3.4815 0.5163 0.0391 23.2616 4.0189 13.0295 18.0980 160.1049 1.4939 34.5028 6.6040 39.0799 20.6911 47.6643 82.5599 15.5743 0.1378 8.7590 4.3764 62.8010 27.4976 5.3510 0.4426 0.2335 2.3360 1.0104 3.3009 7.9229 2.2013 9.1934 14.5015 25.0210 10.3611 61.0160 0.6466 2.3793 8.5255 9.8300 1.5182 8.3152 0.2462 5.9636 28.3300 39.6396 26.3203 11.1100 20.3992 8.5060 17.5887 78.4217 0.3430 5.8343 9.8301 7.1569 6.4127 559.9822 37.0416 103.7675 142.9241 61.3772 108.9800 105.9621 43.4990 39.8797 56.2546 15.7909 11.5329 1.0838 33.9128 26.4447 7.6605 189.1266 0.2246 0.1559
temp: 298.150 k
press: 1.00000 atm
elementType: 8 7 7 7 6 6 6 6 6 6 6 6 6 6 6 1 1 1 1 1 1 1 1 1 1 1 1 1 1 1
symmnumber: 1
zpe: 658437.6 jmol-1
zpe.correction: 0.250786 hartree
zpe.thermalcorrener: 0.263852 hartree
zpe.thermalcorrenthalpy: 0.264796 hartree
zpe.thermalcorrgfe: 0.210383 hartree
zpe.sumelectzpe: -666.526656 hartree
zpe.sumelectthermal: -666.513590 hartree
zpe.sumelectthermalent: -666.512646 hartree
zpe.sumelectthermalfe: -666.567059 hartree
dipole: 2.2858 -3.7441 0.5638
dipole: 4.4228
quadrupole: -77.0345 -91.5788 -87.3540
quadrupole: -2.6435 1.5819 3.5239
quadrupole: 8.2880 -6.2564 -2.0316 -2.6435 1.5819 3.5239
hfenergy: -666.7774418 hartree
pointgroup: C01 [X(C11H15N3O1)]
dipole: 0.9613214 0.3463064 1.408469 debye
polarizability: 204.0083804|0.2514882|85.0863752|-8.0462258|4.7631842|141.7190708 unknown
InChI: InChI=1S/C11H15N3O/c15-11(10-8-12-6-7-13-10)14-9-4-2-1-3-5-9/h1-5,10,12-14H,6-8H2
charge 0 multiplicity 1
30 atoms
O  0.011072 -0.569036 -2.360694
N  2.269125 -0.705525 0.519792
N  3.915675 1.166072 -0.852443
N  -0.294113 -0.207474 -0.040867
C  1.978592 -0.367866 -0.906519
C  2.488061 1.069307 -1.206043
C  3.697264 -0.509451 0.909521
C  4.137295 0.928825 0.588755
C  0.461274 -0.413017 -1.185058
C  -1.703518 -0.118988 0.101107
C  -2.222867 0.088511 1.408416
C  -2.59506 -0.227224 -1.001227
C  -3.613794 0.187307 1.613145
C  -3.985191 -0.126557 -0.778244
C  -4.505827 0.079896 0.520107
H  2.468926 -1.057297 -1.626556
H  2.352457 1.269245 -2.282127
H  1.853036 1.787726 -0.62942
H  4.374118 -1.203303 0.361791
H  3.790995 -0.704663 1.993484
H  3.559734 1.633715 1.236916
H  5.211119 1.04205 0.821126
H  1.978878 -1.675593 0.719438
H  4.359176 2.023157 -1.202594
H  0.301881 -0.101796 0.798994
H  -1.535224 0.173111 2.259634
H  -2.188611 -0.386196 -2.002149
H  -4.000762 0.347536 2.625705
H  -4.666935 -0.210289 -1.632266
H  -5.586777 0.156216 0.679071
