program: Gaussian 09
title: 000118286
version: EM64L-G09RevD.01
frameworkgroup: C1[X(C12H18O)]
method: RPBEPBE
basis: SDD
operation: Freq
keyword: #pfreq=noraman
keyword: PBEPBE/SDD
title: #p freq=noraman PBEPBE/SDD
converged: YES YES NO NO
title: Mulliken charges:
elementType: O C C C C C C C C C C C C H H H H H H H H H H H H H H H H H H
charge: -0.458618 -0.197894 0.503598 -0.391736 -0.379050 -0.459749 -0.406992 0.488967 -0.696702 -0.409915 -0.417836 -0.532719 -0.672368 0.217985 0.243910 0.185117 0.211100 0.190618 0.233248 0.226827 0.207929 0.212115 0.227307 0.228709 0.228033 0.207756 0.207463 0.343237 0.222063 0.214965 0.222631
chargesum: 0.00000
title: Mulliken charges with hydrogens summed into heavy atoms:
elementType: O C C C C C C C C C C C C
charge: -0.115380 0.020091 0.503598 0.037291 0.022668 -0.226501 -0.180166 0.488967 -0.049351 -0.181205 -0.189803 -0.117499 -0.012709
polarizability: 1.77663104e+02 -1.76066678e+00 9.93041135e+01 1.70806244e-01 4.30190264e-01 1.19092745e+02
1716.lowfreq: -22.7377 -10.7262 -3.4273 -0.0007 -0.0005 -0.0004 8.1093 28.4539 49.4036
frequency: -17.4582 28.2720 49.3073 84.2922 99.8026 129.9312 166.3464 193.5986 216.4950 238.6757 243.2370 255.3282 315.4958 334.9662 363.5658 405.3552 452.6121 477.7880 536.5658 571.7989 637.6737 703.2258 747.7360 780.3695 783.2362 815.7647 837.9514 849.3151 861.7750 951.8407 960.8163 968.9808 970.2672 982.1150 1012.0069 1014.8765 1039.8332 1050.4974 1063.3136 1093.8775 1113.4655 1132.4730 1190.4180 1200.1952 1206.9677 1217.5437 1225.4433 1241.6349 1243.4093 1295.9117 1312.5577 1316.1793 1334.8185 1346.2842 1382.6643 1386.9564 1387.3794 1398.7583 1412.3857 1471.5823 1471.6859 1472.9315 1473.3780 1475.0378 1485.2021 1489.0411 1506.2744 1580.7060 1623.0326 2933.4077 2972.1650 2973.5327 2978.0052 2983.7078 2984.4453 3003.3067 3035.0649 3043.9575 3068.1781 3075.9512 3076.3793 3082.6529 3105.8308 3107.8690 3128.3788 3134.9254 3573.9193
redmass: 2.4818 3.4173 3.2733 3.1312 2.9572 3.7670 1.5450 1.7925 1.3628 1.4868 2.0336 1.3976 5.2789 2.5273 2.7102 2.8295 3.2992 2.8602 3.7957 2.3726 6.7517 2.2842 3.4336 2.3995 1.1918 1.5742 1.5880 1.2572 2.3212 1.4271 1.7192 2.3597 1.3907 2.5793 3.0722 2.7286 1.5435 1.6578 2.0442 1.8789 1.7366 1.4282 1.1265 1.5859 1.2798 2.2485 1.5096 1.2938 1.2897 1.3620 1.5044 1.2565 1.4608 1.4320 3.7194 1.1996 1.3016 1.4261 2.3909 1.0489 1.0684 1.0589 1.0673 1.0537 1.0703 1.0932 2.5820 6.4758 6.4960 1.0559 1.0554 1.0487 1.0351 1.0882 1.0597 1.0966 1.1016 1.0965 1.0998 1.0999 1.0999 1.1011 1.0866 1.0869 1.0959 1.0970 1.0666
irintensity: 0.1098 0.1499 0.1850 1.7446 4.0852 2.1382 1.8600 14.8819 8.3057 4.5096 46.3344 77.3193 8.3280 0.6156 0.0998 0.0209 0.0237 13.6943 7.6092 28.6331 0.2402 0.4760 1.7915 1.6778 2.3012 25.2955 47.3291 2.3341 6.7954 4.3989 55.0102 9.6300 0.0365 31.9340 3.0717 21.7927 3.7713 8.8591 17.2894 5.2911 2.9058 10.7857 0.3502 2.0349 16.4326 0.8040 1.3344 2.7558 5.4438 1.9755 2.8172 6.2325 0.6299 0.8606 2.8666 11.2719 9.4861 0.8618 5.3357 8.3816 13.5405 2.9875 2.9885 6.3579 11.1670 8.0350 32.4998 0.1719 0.6004 54.3609 27.9153 20.0987 42.5194 19.1590 36.8743 68.9956 9.2750 4.5124 48.3825 118.4690 10.6373 40.7006 7.9076 24.8211 48.6316 0.3328 2.1311
temp: 298.150 k
press: 1.00000 atm
elementType: 8 6 6 6 6 6 6 6 6 6 6 6 6 1 1 1 1 1 1 1 1 1 1 1 1 1 1 1 1 1 1
symmnumber: 1
zpe: 705467.2 jmol-1
zpe.correction: 0.268698 hartree
zpe.thermalcorrener: 0.282408 hartree
zpe.thermalcorrenthalpy: 0.283352 hartree
zpe.thermalcorrgfe: 0.227686 hartree
zpe.sumelectzpe: -542.288007 hartree
zpe.sumelectthermal: -542.274298 hartree
zpe.sumelectthermalent: -542.273353 hartree
zpe.sumelectthermalfe: -542.329019 hartree
dipole: 0.9003 -1.4126 -0.7477
dipole: 1.8344
quadrupole: -77.5744 -78.8452 -75.5016
quadrupole: 5.2688 3.0938 1.1453
quadrupole: -0.2673 -1.5381 1.8054 5.2688 3.0938 1.1453
hfenergy: -542.556705 hartree
pointgroup: C01 [X(C12H18O1)]
dipole: -0.357721 -0.5119902 0.3616297 debye
polarizability: 177.6693695|-0.0336489|99.4052479|-1.4055794|1.7207077|118.985345 unknown
InChI: InChI=1S/C12H18O/c1-3-10-5-7-12(8-6-10)11(4-2)9-13/h5-8,11,13H,3-4,9H2,1-2H3
charge 0 multiplicity 1
31 atoms
O  4.197556 -1.214568 0.018497
C  2.103243 -0.022512 -0.29753
C  0.583367 -0.112452 -0.150065
C  2.702448 1.29371 0.271217
C  2.762115 -1.259486 0.351766
C  -0.246536 -0.329963 -1.278164
C  -0.042454 -0.010914 1.120994
C  -2.273287 -0.338036 0.123551
C  2.242032 2.549523 -0.498008
C  -1.649072 -0.439869 -1.145018
C  -1.442793 -0.122308 1.253986
C  -3.787749 -0.408823 0.266491
C  -4.449844 0.995371 0.254101
H  2.353153 -0.066383 -1.377181
H  3.803916 1.207247 0.233962
H  2.425744 1.39072 1.34125
H  2.293799 -2.183749 -0.047632
H  2.614265 -1.235533 1.453909
H  0.212525 -0.414452 -2.271188
H  0.568682 0.162163 2.015537
H  2.545885 2.493801 -1.560763
H  2.689432 3.464718 -0.068378
H  1.142575 2.660511 -0.467524
H  -2.267075 -0.608643 -2.036172
H  -1.900683 -0.044151 2.248618
H  -4.214416 -1.015583 -0.555055
H  -4.052394 -0.921157 1.21187
H  4.643722 -2.021717 0.377038
H  -4.064204 1.619741 1.080466
H  -5.547222 0.916438 0.364747
H  -4.23523 1.523758 -0.692518
