program: Gaussian 09
title: 000121716
version: EM64L-G09RevD.01
frameworkgroup: C1[X(C24H26N2O3S3)]
method: RPBEPBE
basis: SDD
operation: Freq
keyword: #p
keyword: freq=noraman
keyword: PBEPBE/SDD
title: #p freq=noraman PBEPBE/SDD
converged: YES YES NO NO
title: Mulliken charges:
elementType: S S S O O O N N C C C C C C C C C C C C C C C C C C C C C C C C H H H H H H H H H H H H H H H H H H H H H H H H H H
charge: 0.210904 1.089545 0.297107 -0.603440 -0.619722 -0.626767 -0.187845 -0.195714 -0.519114 -0.368791 -0.371243 0.605040 -0.096196 -0.354563 -0.622398 -0.232108 -0.340989 -0.033254 0.583493 0.445249 -0.284641 -0.390900 -0.371980 -0.359871 -0.225295 -0.242789 -0.358665 -0.817416 -0.285731 -0.657602 -0.223550 -0.256568 0.247855 0.345564 0.219378 0.211835 0.210398 0.265719 0.272106 0.241772 0.235029 0.264989 0.248985 0.235682 0.232455 0.217674 0.238983 0.238923 0.235413 0.227595 0.246094 0.240493 0.351822 0.241755 0.240252 0.226792 0.230602 0.247649
chargesum: 0.00000
title: Mulliken charges with hydrogens summed into heavy atoms:
elementType: S S S O O O N N C C C C C C C C C C C C C C C C C C C C C C C C
charge: 0.210904 1.089545 0.297107 -0.603440 -0.619722 -0.626767 -0.187845 -0.195714 0.074306 0.062423 0.104875 0.605040 -0.096196 -0.354563 -0.108521 0.002921 -0.076000 -0.033254 0.583493 0.445249 -0.035656 0.077236 -0.154306 -0.359871 0.013688 -0.003865 -0.123252 -0.103234 0.066092 0.051196 0.007052 -0.008919
polarizability: 7.59738780e+02 -8.76902062e+00 4.03732682e+02 2.11892118e+00 -6.15138961e+00 1.80438330e+02
1716.lowfreq: -2.4678 -0.0012 -0.0005 0.0018 3.7472 6.7562 19.6931 23.2678 35.2208
frequency: 19.6046 23.2036 35.1674 45.4844 50.5660 59.4744 63.6139 67.4197 72.6677 89.0150 98.3632 104.0634 113.0166 129.9270 154.5570 167.0868 170.7434 173.7543 191.9968 212.8492 220.0036 225.8034 232.7408 244.6754 256.8704 277.6771 281.0894 285.7673 308.4891 323.9634 343.8481 354.5195 357.4392 378.9042 391.6062 402.1490 415.4299 417.3779 436.4453 444.0314 448.5277 454.5075 485.0256 497.3937 518.8952 524.1418 528.2537 533.1690 552.4284 566.2793 583.2241 602.9209 613.0002 625.5285 667.3921 685.5907 689.7457 697.9068 711.8821 722.5902 727.5824 756.1614 762.5054 766.5187 767.5178 791.8265 801.5980 804.9128 811.4902 822.6351 826.2203 853.4750 864.5046 887.6934 896.2055 913.1662 930.3437 936.8076 938.5451 962.5151 983.2358 1004.5913 1011.6156 1018.7104 1026.1268 1028.2311 1028.5854 1031.0243 1034.7947 1045.2905 1051.7251 1064.2931 1088.6145 1109.8041 1132.3262 1137.7260 1141.2464 1143.6181 1177.2430 1183.8999 1199.0428 1212.7059 1214.0419 1246.1074 1248.5725 1275.7089 1279.4285 1290.9936 1296.6201 1301.3109 1318.8579 1328.8149 1335.5868 1340.6943 1353.4485 1358.8493 1385.3181 1390.1142 1394.8338 1396.8182 1399.5385 1401.7633 1410.8401 1428.5470 1447.0273 1449.6179 1454.9824 1457.8788 1461.7824 1468.8323 1470.8982 1473.0803 1482.0942 1484.6204 1506.6869 1520.9450 1541.7024 1568.4271 1586.2108 1593.2344 1594.7220 1600.2069 2960.5377 2966.4444 2972.0938 2976.9366 2995.2762 3016.4215 3025.9919 3030.9264 3044.4055 3049.9869 3057.4953 3068.7277 3076.3419 3088.8744 3095.6974 3104.9134 3124.4443 3131.1819 3138.2452 3145.2038 3155.6767 3156.3761 3161.1254 3170.1139 3171.6997 3181.0114
redmass: 5.6260 5.1322 6.1933 4.8584 7.5952 4.1385 4.1035 7.1239 4.3992 4.6148 5.1888 4.4619 5.0041 5.9027 4.7536 5.0485 5.8914 5.5807 5.1714 1.2345 1.7923 4.1949 1.4662 4.6125 3.2473 4.2324 3.2524 3.3727 3.1334 3.3621 9.3743 6.1521 4.5185 3.9445 4.6686 4.6546 5.0083 4.9353 3.3834 5.1591 3.6713 3.2113 7.1566 7.2156 3.3200 4.7365 4.1852 6.7135 2.7252 4.8307 4.8988 4.3938 5.4306 5.3720 4.5542 5.7786 5.5229 5.7538 13.0680 3.4728 2.8938 1.3649 1.5829 1.7213 1.8043 2.7709 2.1383 1.5514 1.6047 2.2907 2.1397 1.3622 1.3501 2.8827 5.7879 3.1348 2.7544 2.1075 1.3747 1.3421 1.3221 4.5369 1.3883 1.9413 2.3268 2.5868 2.5553 3.7561 1.5659 2.8277 2.4814 1.9076 1.9640 2.6167 1.7860 1.5688 1.4828 1.6023 1.0899 1.0961 1.7169 2.7973 1.1386 1.7921 1.7711 2.1829 1.2512 1.5737 1.3022 2.1154 1.9708 1.4635 1.5416 1.3541 1.5011 1.4462 1.4819 2.0524 1.2736 1.4337 5.3565 3.9408 1.1183 2.7561 2.5181 2.4192 1.0879 2.5636 2.2409 1.0462 1.0616 1.0832 1.2624 1.0521 1.0886 1.2540 2.7049 5.7193 7.0342 6.6007 6.3316 6.8346 1.0626 1.0693 1.0386 1.0667 1.0357 1.0932 1.0997 1.0611 1.0605 1.0965 1.0997 1.0953 1.1023 1.0981 1.0995 1.1025 1.0863 1.1091 1.0865 1.0861 1.0929 1.0907 1.0850 1.0952 1.0987 1.0998
irintensity: 1.8545 1.4413 1.2435 0.8733 0.2891 0.1298 0.3117 3.0615 0.4095 1.2760 4.0832 5.4169 21.6230 0.2009 0.8175 3.4566 0.4304 3.5977 3.4079 1.6711 1.3506 4.5316 0.7733 1.7495 1.8604 3.6661 5.0447 0.1644 0.1582 0.9679 9.7409 10.3105 8.6309 5.8355 5.9035 8.6830 0.3140 2.8032 9.6238 5.9323 4.7668 5.8828 17.5677 8.7671 6.8090 0.4309 0.3277 48.2991 8.9403 8.7676 1.6682 7.3459 8.7138 6.3058 5.1674 3.9683 19.4417 17.1300 101.4236 5.6506 9.6839 90.1726 84.8467 10.7598 35.7890 87.6972 54.5812 21.8313 22.6167 61.0950 23.4640 0.5933 7.0274 72.4360 89.5546 2.4110 2.0715 18.2962 1.6647 3.5278 0.0192 6.5941 8.0356 0.3404 3.7965 4.1345 27.0398 41.5285 7.7384 3.7350 6.2371 3.0623 33.4582 5.7841 1.9737 8.1051 24.1031 30.5501 4.8285 12.1557 98.0696 19.5925 7.6279 15.7516 7.9935 7.1650 8.8037 18.0415 18.0249 65.4068 32.7440 19.3953 117.1247 160.5955 224.4202 43.8674 146.2599 223.4685 39.4995 11.9721 2.3003 4.0575 7.6639 75.5234 9.7697 51.4705 15.0491 95.8451 38.8868 10.3218 25.9419 6.5602 413.1642 9.1220 23.5525 295.2690 1325.5778 607.6761 3.5216 111.2562 3.0592 11.3775 22.7223 73.4961 8.5520 11.2679 20.9239 20.2367 14.8387 37.0987 11.6734 9.4503 97.9822 18.3843 0.3787 20.3150 41.6843 22.3144 20.6618 6.7864 4.1329 0.8888 13.0507 6.0006 1.4137 17.7309 33.9257 15.4017
temp: 298.150 k
press: 1.00000 atm
elementType: 16 16 16 8 8 8 7 7 6 6 6 6 6 6 6 6 6 6 6 6 6 6 6 6 6 6 6 6 6 6 6 6 1 1 1 1 1 1 1 1 1 1 1 1 1 1 1 1 1 1 1 1 1 1 1 1 1 1
symmnumber: 1
zpe: 1182223.8 jmol-1
zpe.correction: 0.450285 hartree
zpe.thermalcorrener: 0.481467 hartree
zpe.thermalcorrenthalpy: 0.482411 hartree
zpe.thermalcorrgfe: 0.387220 hartree
zpe.sumelectzpe: -2456.994442 hartree
zpe.sumelectthermal: -2456.963260 hartree
zpe.sumelectthermalent: -2456.962316 hartree
zpe.sumelectthermalfe: -2457.057507 hartree
dipole: -1.7331 -14.5809 4.6412
dipole: 15.3996
quadrupole: -146.4559 -231.1197 -219.1116
quadrupole: -24.7635 2.6245 12.9714
quadrupole: 52.4398 -32.2240 -20.2159 -24.7635 2.6245 12.9714
hfenergy: -2457.4447268 hartree
pointgroup: C01 [X(C24H26N2O3S3)]
dipole: -0.7096587 5.8742271 -1.3028418 debye
polarizability: 759.6357805|10.2052648|403.113918|-4.9485834|13.7100859|181.1600943 unknown
InChI: InChI=1S/C24H26N2O3S3/c1-3-25-19-10-4-6-12-21(19)30-23(25)16-18(2)17-24-26(14-8-9-15-32(27,28)29)20-11-5-7-13-22(20)31-24/h4-7,10-13,16-17H,3,8-9,14-15H2,1-2H3
charge 0 multiplicity 1
58 atoms
S  -3.618779 2.545057 0.804357
S  0.678655 -3.576972 0.176391
S  1.773629 0.077114 0.770726
O  -0.497662 -4.660449 0.544161
O  2.223751 -4.128413 0.012697
O  0.63278 -2.20247 1.141505
N  -2.875883 0.031299 0.377936
N  3.554284 2.045821 0.584324
C  -2.086056 -1.207505 0.095923
C  -1.937204 -1.440149 -1.428068
C  -1.30232 -2.804592 -1.803557
C  -4.287378 -0.01989 0.46988
C  -2.309812 1.298313 0.504648
C  -4.883408 1.244603 0.714594
C  0.212494 -2.932896 -1.614994
C  -0.932222 1.553538 0.42939
C  -5.10713 -1.167346 0.351582
C  2.181363 1.845222 0.605823
C  4.334006 0.855717 0.616666
C  -0.212357 2.781393 0.534941
C  -6.271275 1.402709 0.8532
C  4.185714 3.382267 0.460426
C  1.208743 2.874482 0.550693
C  3.54524 -0.323449 0.704564
C  -6.502889 -1.016132 0.489624
C  -7.085745 0.251743 0.738774
C  5.743389 0.756373 0.55745
C  -0.956993 4.105784 0.629707
C  4.106374 -1.612515 0.715315
C  4.355496 3.820164 -1.008953
C  6.320812 -0.531227 0.584589
C  5.517163 -1.698529 0.656555
H  -2.623201 -2.051495 0.561866
H  -1.104395 -1.188903 0.609053
H  -1.343927 -0.616288 -1.872566
H  -2.944126 -1.391126 -1.889574
H  -1.525326 -2.990446 -2.873058
H  -1.78291 -3.631256 -1.238142
H  0.644479 -3.722786 -2.249693
H  0.783813 -1.995236 -1.713582
H  -0.351459 0.646569 0.252653
H  -4.676661 -2.15371 0.160752
H  -6.713633 2.384855 1.0451
H  5.16259 3.336641 0.970608
H  3.575272 4.109966 1.021132
H  1.60013 3.898271 0.535522
H  -7.144077 -1.899091 0.40259
H  -8.171164 0.344616 0.84338
H  6.380108 1.643031 0.482352
H  -0.260382 4.959519 0.596187
H  -1.52053 4.179092 1.580272
H  -1.685541 4.229914 -0.193139
H  3.474319 -2.513826 0.731065
H  4.987237 3.105228 -1.563807
H  3.378829 3.882772 -1.518934
H  4.835784 4.813853 -1.054188
H  7.410952 -0.626663 0.538242
H  5.987943 -2.686564 0.657335
