program: Gaussian 09
title: 000118664
version: EM64L-G09RevD.01
frameworkgroup: C1[X(C25H20N6O7S2)]
method: RPBEPBE
basis: SDD
operation: Freq
keyword: #p
keyword: freq=noraman
keyword: PBEPBE/SDD
title: #p freq=noraman PBEPBE/SDD
converged: YES YES NO NO
title: Mulliken charges:
elementType: S S O O O O O O O N N N N N N C C C C C C C C C C C C C C C C C C C C C C C C C H H H H H H H H H H H H H H H H H H H H
charge: 0.992871 0.987433 -0.567369 -0.568820 -0.502943 -0.499673 -0.502095 -0.505106 -0.266217 -0.498652 -0.498405 -0.117239 -0.117666 -0.104882 -0.100982 0.488792 0.488795 -0.013450 -0.004576 0.214675 0.205455 -0.361216 -0.304229 0.152125 0.157400 -0.435976 -0.299711 -0.299760 -0.434898 -0.249799 -0.253326 -0.322857 -0.287867 -0.283106 -0.319632 0.279466 -0.294119 -0.341627 -0.174282 -0.178950 0.304149 0.323243 0.222810 0.309974 0.310437 0.223647 0.297796 0.298074 0.287024 0.287281 0.255037 0.277305 0.280653 0.260955 0.283911 0.262396 0.244577 0.247598 0.383533 0.382017
chargesum: 0.00000
title: Mulliken charges with hydrogens summed into heavy atoms:
elementType: S S O O O O O O O N N N N N N C C C C C C C C C C C C C C C C C C C C C C C C C
charge: 0.992871 0.987433 -0.183836 -0.186803 -0.502943 -0.499673 -0.502095 -0.505106 -0.266217 -0.200856 -0.200331 -0.117239 -0.117666 -0.104882 -0.100982 0.488792 0.488795 -0.013450 -0.004576 0.214675 0.205455 -0.057067 0.019014 0.152125 0.157400 -0.213166 0.010263 0.010677 -0.211251 0.037226 0.033955 -0.067820 -0.010562 -0.002452 -0.058678 0.279466 -0.010208 -0.079231 0.070295 0.068648
polarizability: 1.22619219e+03 4.26354983e+01 4.48597668e+02 -2.74275165e+00 -2.41465705e+00 1.82532133e+02
1716.lowfreq: -5.7457 -2.2061 -1.8920 0.0014 0.0019 0.0021 4.4826 7.3866 12.5880
frequency: 3.7662 7.3259 12.5824 16.3764 19.4304 23.9390 24.5608 29.0195 39.3580 52.3895 53.8855 78.6566 80.2888 89.6173 96.9050 104.5651 116.2554 118.3800 122.9259 128.2395 152.9500 166.6792 171.3124 192.9359 205.0970 210.9681 216.0918 227.6628 230.4563 235.6386 248.5122 262.9468 275.1183 275.7578 282.4362 294.4341 317.5219 326.4172 330.8291 345.7594 357.0862 371.2144 376.1790 383.4111 394.9012 418.2649 420.4713 422.4804 424.9601 444.8820 450.3014 485.4067 486.4060 521.4709 523.1191 524.0680 533.1096 544.3774 549.6004 553.6544 595.3663 598.6516 618.7594 625.7718 630.2322 635.9673 643.2215 665.6345 684.3001 687.8408 690.0341 700.0492 743.1814 744.8844 762.4008 785.7957 809.6813 812.8339 823.0755 825.6059 828.0882 828.8600 840.1976 844.5876 877.1801 878.4943 879.7523 898.9942 903.0370 926.8696 936.1978 944.0710 945.4245 962.7712 964.5414 966.2618 966.3451 975.1242 975.1288 992.7299 995.7891 998.1804 1002.8311 1005.8526 1011.1183 1012.7204 1043.1096 1045.4655 1052.0267 1055.1906 1082.1735 1083.2584 1118.5447 1120.0778 1137.8581 1140.3670 1159.0785 1162.3692 1168.0575 1179.5441 1181.0249 1226.9416 1233.5108 1255.1900 1269.5267 1276.8941 1284.0781 1302.2655 1306.5472 1340.0355 1346.8375 1365.6009 1371.4299 1378.5958 1387.0658 1426.2407 1430.4718 1435.3797 1437.4330 1445.8466 1448.1395 1488.5528 1493.8723 1499.4424 1509.9733 1555.0923 1563.3525 1575.7882 1585.2062 1597.5276 1605.6835 1615.2811 1617.3008 1658.8829 3115.3872 3118.3252 3149.1475 3152.4344 3164.5572 3165.9638 3166.1559 3166.6072 3166.9333 3167.3858 3168.3062 3169.0896 3177.7392 3179.7152 3200.9100 3202.1399 3482.0905 3482.2293 3511.5065 3523.7853
redmass: 7.8755 8.0151 9.8035 8.6334 6.7029 5.1115 6.1586 9.9486 4.5512 8.9853 6.4301 5.6254 6.5164 8.4114 5.9317 6.3863 8.7318 6.2023 7.9423 5.4941 6.7305 1.9092 1.5445 3.5572 7.0557 4.8455 6.0870 5.2162 5.8225 5.4757 7.0082 4.4831 5.4403 6.1760 3.8148 5.4117 6.9718 9.7584 9.8344 9.0125 10.1839 3.3620 5.9921 4.9254 5.6240 3.1380 3.3045 10.9507 10.2540 3.1760 3.3496 1.9767 8.6183 3.8295 6.2629 6.1454 5.6905 5.0700 5.5536 3.1214 5.5673 5.5608 7.0217 7.2145 7.2358 1.2144 7.2297 7.4794 3.6150 2.4219 2.9452 9.2573 3.6992 3.7643 7.0288 6.0951 1.4459 1.4380 7.0929 1.3901 8.7819 1.3654 9.3619 8.4352 1.5226 5.3546 1.4980 7.2226 7.6416 1.4482 1.3479 1.4134 1.4967 1.3823 9.5822 10.9537 1.3981 5.9105 5.6469 4.1891 2.7675 1.3644 3.4731 1.3588 1.3195 1.3170 1.5050 1.5114 1.4225 1.4546 1.5704 1.4829 1.3464 1.3427 2.4477 2.4079 1.3558 1.2752 2.0324 1.3995 1.3832 2.1224 2.5536 2.5915 1.3583 1.5875 1.6336 1.4043 1.9619 6.4142 6.8979 4.7977 5.3871 6.1309 6.8623 3.4528 3.2410 4.6312 4.3757 2.3137 2.6941 2.8229 2.3668 2.0752 2.7028 6.2584 6.8685 4.9433 4.5987 7.0462 7.5328 6.1260 5.8026 4.0975 1.0901 1.0900 1.0874 1.0873 1.0918 1.0903 1.0939 1.0926 1.0914 1.0923 1.0950 1.0926 1.0989 1.0998 1.0950 1.0949 1.0661 1.0661 1.0767 1.0756
irintensity: 1.1332 0.3286 0.4901 0.1853 1.8824 1.9742 1.3813 0.0966 0.0318 1.1913 1.7570 0.3921 11.5849 0.5349 0.9468 0.0835 1.0274 1.1456 1.1903 0.2870 17.1854 48.2188 15.0103 72.3300 1.1043 1.3335 10.9156 15.6898 0.6119 0.9305 15.5857 3.0787 0.0472 3.2602 109.7139 19.7972 3.3801 8.2106 7.5450 7.3995 5.8480 0.1131 6.6590 5.9375 2.5274 0.5343 0.6513 112.6403 112.1803 6.9822 15.2896 0.5342 19.7844 64.7400 21.6463 6.7994 11.3572 366.3392 2.3552 2.5341 16.3782 13.5583 8.3250 14.4686 1.9841 105.5716 1.6286 9.8196 2.8256 80.5516 7.1960 20.0270 0.1641 12.2909 1.4598 5.2785 34.8440 33.6721 4.7066 23.2566 108.6723 66.0858 18.0181 45.2107 3.4253 0.4515 122.4390 0.8925 14.5503 21.9609 1.5657 4.2265 21.0822 0.8259 73.0646 76.1434 2.8642 23.6191 10.3976 0.1339 4.3984 0.8568 1.2556 1.3520 0.1602 0.5968 26.5649 28.7499 72.3729 69.9449 13.4412 20.8198 9.0485 23.7165 333.1572 146.4286 848.3879 221.0818 438.0897 4.1822 1.1337 7.7348 2.1633 1063.1774 7.2916 56.7856 28.3405 153.5705 3.3338 1512.0351 152.7957 15.5438 218.7696 151.2059 4.8901 22.2486 26.2180 14.2439 69.3306 19.5316 13.7625 874.1908 47.9329 1377.5856 13.6938 9.7565 14.7823 519.9376 8.0502 12.5526 11.3299 492.4147 23.0071 80.8211 31.1446 29.1552 16.3379 14.2950 9.3092 2.3048 6.5454 2.5438 4.3605 4.8624 4.2590 7.2984 8.2111 9.6746 6.2577 4.8769 49.6858 48.2942 1.1868 30.7008
temp: 298.150 k
press: 1.00000 atm
elementType: 16 16 8 8 8 8 8 8 8 7 7 7 7 7 7 6 6 6 6 6 6 6 6 6 6 6 6 6 6 6 6 6 6 6 6 6 6 6 6 6 1 1 1 1 1 1 1 1 1 1 1 1 1 1 1 1 1 1 1 1
symmnumber: 1
zpe: 1091654.2 jmol-1
zpe.correction: 0.415789 hartree
zpe.thermalcorrener: 0.454164 hartree
zpe.thermalcorrenthalpy: 0.455108 hartree
zpe.thermalcorrgfe: 0.335453 hartree
zpe.sumelectzpe: -2612.629596 hartree
zpe.sumelectthermal: -2612.591222 hartree
zpe.sumelectthermalent: -2612.590278 hartree
zpe.sumelectthermalfe: -2612.709933 hartree
dipole: -1.0817 -6.7017 -0.3504
dipole: 6.7974
quadrupole: -364.3134 -205.5314 -257.8607
quadrupole: 57.8282 37.8462 -12.2671
quadrupole: -88.4116 70.3704 18.0412 57.8282 37.8462 -12.2671
hfenergy: -2613.0453855 hartree
pointgroup: C01 [X(C25H20N6O7S2)]
dipole: 0.534688 2.3584847 1.141778 debye
polarizability: 1228.3877966|10.7160563|382.7767009|1.2116546|112.8864991|246.1574977 unknown
InChI: InChI=1S/C25H20N6O7S2/c32-25(26-17-7-11-19(12-8-17)28-30-21-3-1-5-23(15-21)39(33,34)35)27-18-9-13-20(14-10-18)29-31-22-4-2-6-24(16-22)40(36,37)38/h1-16,26-27,33,36H
charge 0 multiplicity 1
60 atoms
S  11.164715 -2.790457 -1.513261
S  -11.97753 0.25108 0.107761
O  11.295992 -2.107347 -3.237201
O  -12.151828 -0.664505 1.718637
O  12.658931 -3.075528 -0.962258
O  10.047649 -3.959933 -1.504046
O  -11.459804 1.75178 0.417042
O  -13.322498 0.011373 -0.760658
O  0.113051 0.17365 -0.076585
N  1.091183 2.065052 0.943199
N  -1.232892 1.86265 0.877299
N  7.143441 0.182304 -0.049216
N  -6.819727 -0.897014 -0.673382
N  6.690069 1.275346 0.515946
N  -6.581166 0.212774 -0.019156
C  2.471738 1.788002 0.788665
C  -2.534748 1.372018 0.611261
C  10.479424 -1.221379 -0.748395
C  -10.569262 -0.814001 -0.551764
C  8.574859 0.098313 -0.085647
C  -8.213533 -1.191512 -0.830586
C  9.088827 -1.078432 -0.690356
C  -9.266115 -0.387368 -0.305076
C  5.27161 1.376949 0.56714
C  -5.206113 0.530997 0.152501
C  3.384225 2.759725 1.291617
C  -2.788725 0.154323 -0.089494
C  2.972026 0.603524 0.168267
C  -3.627314 2.158189 1.078113
C  11.396762 -0.282698 -0.25024
C  -10.920071 -1.969009 -1.275867
C  4.766525 2.555158 1.181061
C  -4.110581 -0.253528 -0.312662
C  4.355534 0.407813 0.063253
C  -4.946023 1.741346 0.851165
C  -0.00001 1.273733 0.529751
C  9.470798 1.080454 0.427731
C  -8.520154 -2.36979 -1.560298
C  10.862618 0.886273 0.347168
C  -9.859846 -2.753005 -1.784979
H  8.405174 -1.84033 -1.077131
H  -9.034815 0.525725 0.25224
H  3.006047 3.672943 1.76867
H  -1.946872 -0.44324 -0.441445
H  2.26741 -0.134612 -0.216802
H  -3.438976 3.095195 1.617573
H  0.887699 2.952738 1.408922
H  -1.211494 2.748214 1.38884
H  12.474394 -0.462039 -0.312061
H  -11.969478 -2.230129 -1.44238
H  5.48099 3.291216 1.562586
H  -4.321906 -1.183538 -0.848764
H  4.75509 -0.495191 -0.407757
H  -5.797206 2.332916 1.202161
H  9.046743 1.977963 0.887645
H  -7.687335 -2.965247 -1.947279
H  11.545953 1.6423 0.747137
H  -10.083094 -3.660675 -2.35376
H  11.654018 -2.836339 -3.823412
H  -12.906376 -0.242189 2.224069
