program: Gaussian 09
title: 000118469
version: EM64L-G09RevD.01
frameworkgroup: C1[X(C13Br10O3)]
method: RPBEPBE
basis: SDD
operation: Freq
keyword: #p
keyword: freq=noraman
keyword: PBEPBE/SDD
title: #p freq=noraman PBEPBE/SDD
converged: YES YES NO NO
title: Mulliken charges:
elementType: Br Br Br Br Br Br Br Br Br Br O O O C C C C C C C C C C C C C
charge: 0.150427 0.150437 0.153881 0.153870 0.144336 0.144340 0.143278 0.143275 0.141061 0.141060 -0.245726 -0.245725 -0.154372 0.661872 0.661851 -0.374838 -0.374810 -0.354979 -0.354990 -0.138310 -0.138299 -0.134962 -0.134970 -0.206290 -0.206293 0.274874
chargesum: 0.00000
title: Mulliken charges with hydrogens summed into heavy atoms:
polarizability: 4.38752536e+02 1.35600782e+01 4.06947641e+02 4.11437085e-03 7.15832224e-04 1.61100023e+02
1716.lowfreq: -1.3404 -0.3173 -0.0004 -0.0002 -0.0001 3.0466 5.9121 13.1527 14.5400
frequency: 5.8819 13.1519 14.5272 26.4392 27.4116 36.3761 37.4181 41.3719 45.3274 58.9684 65.6662 108.7306 113.2345 130.0115 136.0205 137.1927 137.3198 140.3830 149.4859 149.6505 157.4583 177.6835 200.2125 200.7958 201.8040 211.9088 213.4985 225.6922 227.0586 272.5599 296.8473 305.2363 306.0738 341.7364 354.0159 377.4759 490.7083 528.1145 528.6933 563.5637 580.5718 580.7752 598.2862 599.8923 602.2511 634.8051 655.7255 674.4374 703.5214 739.6432 755.6460 765.5621 767.8923 838.6328 862.9525 948.6727 1016.2201 1050.8916 1086.6297 1173.8683 1186.1381 1287.5279 1289.3701 1310.6240 1310.8694 1318.2804 1329.5659 1502.3650 1504.6618 1505.7584 1506.9129 1683.7890
redmass: 68.1517 53.8165 57.6171 62.2082 45.9289 66.7525 75.0761 66.0552 74.1934 51.9417 16.3875 22.6176 15.1348 59.3016 63.5315 63.6463 71.4318 60.6799 78.6769 78.4203 31.4835 14.1635 26.4555 64.5188 21.9094 57.0356 67.9749 69.8372 73.3203 16.9064 16.1685 12.2911 12.7255 14.3881 12.3676 14.6621 14.0946 13.7160 13.7068 13.2201 12.0470 12.0441 12.5544 12.4969 12.3945 13.2716 12.7843 13.4040 12.9473 12.2813 12.5615 12.3954 12.3944 14.2556 12.5864 13.3625 12.3897 12.7012 12.6326 12.2209 12.4151 12.0257 12.0249 12.0007 12.0014 12.0875 12.2798 12.0032 12.0022 12.0110 12.0017 13.1584
irintensity: 0.0001 0.0177 0.0131 0.0110 0.0001 0.0061 0.0002 0.0194 0.0101 0.0793 0.2311 0.9397 1.4719 0.4149 0.0166 1.1383 0.1019 0.4112 0.0001 0.0188 0.3865 1.0039 0.3487 0.0017 0.5663 0.0972 0.0031 0.0864 0.0014 0.2481 0.0127 0.1154 0.0053 0.7818 0.0396 24.3704 3.9051 0.8952 48.5283 6.6473 0.0004 0.0275 0.0791 23.3642 1.0378 37.6355 23.0930 1.9569 8.5759 4.9544 2.6734 0.0044 2.1258 11.6873 13.2654 0.0132 166.9260 9.6610 1790.9940 0.1494 13.1993 6.6409 313.5851 0.1045 9.5808 510.3288 22.1103 0.4334 3.4318 9.5831 1.3205 175.4940
temp: 298.150 k
press: 1.00000 atm
elementType: 35 35 35 35 35 35 35 35 35 35 8 8 8 6 6 6 6 6 6 6 6 6 6 6 6 6
symmnumber: 1
zpe: 240021.4 jmol-1
zpe.correction: 0.091419 hartree
zpe.thermalcorrener: 0.120572 hartree
zpe.thermalcorrenthalpy: 0.121516 hartree
zpe.thermalcorrgfe: 0.019381 hartree
zpe.sumelectzpe: -853.734623 hartree
zpe.sumelectthermal: -853.705470 hartree
zpe.sumelectthermalent: -853.704526 hartree
zpe.sumelectthermalfe: -853.806661 hartree
dipole: 0.0000 0.0000 0.1523
dipole: 0.1523
quadrupole: -223.1625 -224.0849 -245.1738
quadrupole: 0.6413 0.0001 0.0003
quadrupole: 7.6445 6.7222 -14.3667 0.6413 0.0001 0.0003
hfenergy: -853.8260427 hartree
pointgroup: C01 [X(C13Br10O3)]
dipole: -0.0000512 -0.0000157 0.05993 debye
dipolederiv: -0.0865318 0.2734992 0.115358 0.2973666 -0.3164713 -0.1691496 0.1060796 -0.1511883 -0.0031144 -0.0862689 0.2733558 -0.1154071 0.2972245 -0.3165308 0.1694727 -0.1061047 0.1514648 -0.00333 -0.1186102 -0.3086841 0.0488221 -0.3269019 -0.3310519 0.0480001 0.0322881 0.0644876 0.0540441 -0.1183955 -0.3085081 -0.0492299 -0.3267415 -0.3311071 -0.0487106 -0.0327328 -0.0651728 0.0538659 -0.0644258 0.2327584 0.0614075 0.2820709 -0.4064067 -0.1547702 0.08941 -0.1586949 0.0115366 -0.0642356 0.2325707 -0.0614493 0.2818951 -0.4064826 0.1550503 -0.089436 0.1588876 0.0114253 -0.1119415 -0.2762505 -0.0061151 -0.3236502 -0.4171123 0.0195394 0.0142904 0.0305168 0.0629237 -0.1118632 -0.2761686 0.0057325 -0.3235762 -0.4171529 -0.0202408 -0.0146916 -0.0311375 0.0628881 -0.564565 -0.0056843 0.2020291 -0.0062826 0.0889802 0.0054779 0.2433661 0.0052738 -0.0170312 -0.5638431 -0.0056636 -0.2029103 -0.0062453 0.0889825 -0.0054712 -0.244248 -0.0052591 -0.0177552 -2.3934895 -0.0230614 -0.1236003 -0.0504364 -0.235624 0.0008567 -0.2555992 -0.0123722 -0.4086871 -2.3940166 -0.0231577 0.1204839 -0.0505401 -0.2356196 -0.0008761 0.252539 0.0124099 -0.4080952 -0.9011673 0.0014401 -0.0001114 0.0262789 -0.2065199 0.0001764 -0.0001045 0.0001389 -0.7610036 1.1893836 0.0108115 -0.000479 -0.0023235 -0.0871171 -0.0401271 -0.4529309 -0.0372211 0.0945676 1.188697 0.0107621 0.0021713 -0.002482 -0.0871553 0.0400333 0.4545751 0.037122 0.0952901 0.0097088 -0.4410581 -0.2091534 -0.6180303 0.3960744 0.3242678 -0.1639845 0.2209726 0.0392177 0.0092535 -0.4408309 0.2089829 -0.6176895 0.3961586 -0.3250631 0.1637303 -0.2214582 0.0395843 0.1052062 0.4876662 -0.0905697 0.6644149 0.4139253 -0.1705808 0.0258987 -0.1049915 -0.0761379 0.1049119 0.4874264 0.0910771 0.6640283 0.4140038 0.1719122 -0.0252615 0.106068 -0.0759078 -0.1559149 -0.4802683 -0.0185031 -0.6244281 0.6149415 0.2942877 -0.0438665 0.2865045 0.0153598 -0.155891 -0.4799087 0.0180542 -0.6240178 0.6150419 -0.2950648 0.0433477 -0.2870522 0.0152166 -0.0585982 0.5386894 0.1109824 0.6735816 0.6337145 -0.111664 0.1131331 -0.0964589 -0.0967066 -0.0583729 0.5385125 -0.1107306 0.6733984 0.6337507 0.1129966 -0.1128346 0.0975615 -0.0969791 0.8669711 -0.0028906 -0.3377285 0.0016012 -0.3904558 -0.0476717 -0.3748712 -0.0467518 0.0519729 0.8658255 -0.0029637 0.3390386 0.0015067 -0.3904813 0.047541 0.3761917 0.0466106 0.0531684 3.6681733 -0.0123938 0.0018477 0.0399783 0.2797152 -0.000222 0.0018163 -0.00026 1.303687 unknown
polarizability: 437.9998104|14.3959186|407.7001694|0.2260506|0.0666721|161.1002196 unknown
InChI: InChI=1S/C13Br10O3/c14-1-3(16)7(20)11(8(21)4(1)17)25-13(24)26-12-9(22)5(18)2(15)6(19)10(12)23
charge 0 multiplicity 1
26 atoms
Br 2.195651 2.842008 1.065694
Br -2.197001 -2.842277 1.061123
Br 1.966482 -2.828147 0.305024
Br -1.967389 2.82825 0.303246
Br 5.129207 -2.846635 -0.963226
Br -5.127938 2.846855 -0.970193
Br 5.376553 2.937342 -0.163339
Br -5.375979 -2.937471 -0.172977
Br 6.828524 0.064435 -1.192007
Br -6.826588 -0.06433 -1.202888
O  1.107764 0.00422 1.138018
O  -1.109551 -0.004529 1.136307
O  0.00072 0.000361 -0.952798
C  2.390567 0.015628 0.535296
C  -2.391413 -0.015729 0.531567
C  3.092687 1.239969 0.455555
C  -3.093281 -1.240103 0.450223
C  2.989981 -1.19691 0.124114
C  -2.990307 1.196918 0.119922
C  4.310268 -1.185099 -0.393078
C  -4.309752 1.185168 -0.399408
C  4.415048 1.257934 -0.056257
C  -4.414818 -1.258007 -0.063715
C  5.022412 0.044012 -0.484737
C  -5.021617 -0.043983 -0.492703
C  -0.000231 0.000025 0.281237
