program: Gaussian 09
title: 000118209
version: EM64L-G09RevD.01
frameworkgroup: C1[X(C15H21N)]
method: RPBEPBE
basis: SDD
operation: Freq
keyword: #pfreq=noraman
keyword: PBEPBE/SDD
title: #p freq=noraman PBEPBE/SDD
converged: YES YES NO NO
title: Mulliken charges:
elementType: N C C C C C C C C C C C C C C C H H H H H H H H H H H H H H H H H H H H H
charge: -0.092302 -0.100161 -0.428454 -0.413086 -0.365491 -0.387227 -0.626769 -0.425419 0.528628 -0.056386 -0.409708 -0.425824 -0.232070 -0.231225 -0.583919 -0.245564 0.232205 0.208936 0.219163 0.211751 0.190969 0.179353 0.223128 0.191151 0.203883 0.220440 0.216503 0.184810 0.211937 0.236469 0.228249 0.230600 0.222105 0.222601 0.216444 0.217619 0.226662
chargesum: 0.00000
title: Mulliken charges with hydrogens summed into heavy atoms:
elementType: N C C C C C C C C C C C C C C C
charge: -0.092302 0.132044 -0.000355 -0.010366 0.036990 0.007807 -0.189826 -0.028672 0.528628 0.180083 -0.181459 -0.195225 -0.009965 -0.008624 -0.149855 -0.018902
polarizability: 2.28067400e+02 -7.65323929e+00 1.57829560e+02 -1.31520544e+01 -7.53780625e+00 1.15548553e+02
1716.lowfreq: -7.3727 0.0002 0.0003 0.0005 6.4731 14.2171 27.4994 41.2435 57.8170
frequency: 27.2711 40.9933 57.7655 77.0271 88.7848 113.6408 131.9427 181.6707 236.1984 253.2802 286.7982 313.4493 353.0752 369.8831 395.6046 404.4931 437.3818 471.2262 487.0319 510.8065 578.3256 588.6336 617.8242 659.7436 705.0341 741.6792 766.1972 806.6511 817.8173 821.6766 852.3744 864.9026 880.7179 907.5759 916.2214 931.2082 949.0561 962.9350 973.4247 975.5182 989.5022 991.3325 1003.6087 1014.6723 1026.5428 1059.0032 1068.5039 1082.2622 1100.4548 1116.8513 1129.4060 1145.3978 1165.8474 1171.3783 1187.4117 1192.8973 1201.6226 1219.7752 1258.7999 1269.2313 1273.8236 1280.2170 1291.4623 1313.3051 1328.7888 1330.0678 1339.1361 1343.4378 1348.3329 1359.7542 1375.3305 1382.3745 1426.5580 1439.4591 1452.5080 1458.6776 1463.5826 1469.1285 1482.4054 1486.5746 1487.9540 1590.0832 1612.4738 1655.9870 2843.4426 2860.7713 2968.5193 2972.0610 2979.2835 2984.2868 2992.3219 2995.1743 3029.6030 3033.1348 3047.5484 3052.3044 3056.8107 3084.4045 3104.3313 3110.5781 3112.2543 3129.4664 3140.7534 3160.4808 3194.5910
redmass: 3.9923 3.7988 2.8683 3.2212 3.3724 2.4419 3.2849 3.0933 3.3940 2.6690 2.5771 2.0840 2.3428 2.2831 2.2128 2.8144 2.5819 2.8014 3.0867 2.4396 1.7901 3.3084 6.2479 1.9998 1.8436 1.9124 2.9837 2.0134 1.7202 3.8045 1.2589 2.3195 1.5610 1.5442 1.5971 1.8563 1.3597 1.7732 1.5433 1.7243 6.2039 1.3112 1.9939 1.2480 2.1935 2.1372 1.5941 1.4704 1.9521 1.8389 1.9978 2.2540 1.5732 1.0722 1.1179 1.3454 1.3991 2.5550 1.2077 1.4070 1.2612 1.2652 1.5221 1.3961 1.2862 1.2631 1.3513 1.4290 1.4661 1.4156 1.4622 6.2392 1.2077 2.1608 1.0902 1.0914 1.0891 1.0987 2.1406 1.1384 1.0863 5.9469 6.1151 4.6847 1.0710 1.0684 1.0810 1.0631 1.0872 1.0619 1.0610 1.0651 1.0902 1.0926 1.1026 1.0997 1.1022 1.0599 1.0940 1.0872 1.0867 1.0904 1.0956 1.1014 1.1140
irintensity: 0.0263 0.0349 0.0961 0.0538 0.3787 0.8429 0.1046 0.2506 0.4851 1.3986 2.3928 1.7632 0.4604 2.6242 0.8510 0.0080 5.7564 5.4604 2.3342 16.1229 9.9872 4.6483 0.2110 7.1230 43.3442 42.5690 3.6239 9.3602 2.8567 2.4736 0.3470 8.0580 6.9927 4.2303 2.6517 8.5277 80.2593 17.8963 5.0884 17.5056 0.0758 0.3506 44.2305 10.7338 8.5081 1.4281 0.5551 14.6134 15.5360 35.2408 20.0377 10.9013 20.7360 1.0171 0.5247 5.4225 11.8267 1.3298 12.1345 7.8783 0.9402 12.8619 33.9246 2.7787 35.1354 16.3397 1.0262 4.7942 0.3000 2.2372 1.2763 1.4816 15.8993 7.6538 4.7249 8.4063 12.6055 11.4796 24.7790 12.6167 2.1159 1.4927 24.6446 10.7452 57.5057 100.3156 16.6447 30.9543 30.0345 30.7798 36.5826 31.6804 44.4691 63.0647 32.2286 23.5515 67.7377 13.5027 10.8764 10.4967 11.7444 9.1418 46.4775 27.2720 29.8920
temp: 298.150 k
press: 1.00000 atm
elementType: 7 6 6 6 6 6 6 6 6 6 6 6 6 6 6 6 1 1 1 1 1 1 1 1 1 1 1 1 1 1 1 1 1 1 1 1 1
symmnumber: 1
zpe: 848115.8 jmol-1
zpe.correction: 0.323030 hartree
zpe.thermalcorrener: 0.338354 hartree
zpe.thermalcorrenthalpy: 0.339299 hartree
zpe.thermalcorrgfe: 0.279274 hartree
zpe.sumelectzpe: -637.697213 hartree
zpe.sumelectthermal: -637.681889 hartree
zpe.sumelectthermalent: -637.680944 hartree
zpe.sumelectthermalfe: -637.740969 hartree
dipole: 0.0621 0.1980 -0.3544
dipole: 0.4107
quadrupole: -95.2823 -94.2710 -99.4677
quadrupole: -0.7789 -2.6285 -2.5767
quadrupole: 1.0580 2.0693 -3.1273 -0.7789 -2.6285 -2.5767
hfenergy: -638.0202431 hartree
pointgroup: C01 [X(C15H21N1)]
dipole: -0.0258445 0.0737087 0.1414505 debye
polarizability: 226.8672038|11.1067631|158.316562|-14.7890449|7.7234535|116.2617474 unknown
InChI: InChI=1S/C15H21N/c1-2-11-16-12-7-6-10-15(16)13-14-8-4-3-5-9-14/h2-5,8-9,15H,1,6-7,10-13H2
charge 0 multiplicity 1
37 atoms
N  -1.9779 -0.029772 -0.259015
C  -0.521286 0.166578 -0.483957
C  -0.277162 1.598267 -1.02366
C  -0.89526 2.682777 -0.110177
C  -2.607407 0.962175 0.643987
C  -2.397109 2.396388 0.116665
C  0.373847 -0.164047 0.776745
C  -2.3858 -1.427321 0.007973
C  1.85083 -0.255191 0.438925
C  -3.833255 -1.675893 -0.37379
C  2.368441 -1.405012 -0.216655
C  2.745763 0.806947 0.733227
C  3.733507 -1.490435 -0.569119
C  4.112988 0.726295 0.384246
C  -4.750716 -2.287043 0.416314
C  4.612782 -0.422991 -0.270883
H  -0.223053 -0.55123 -1.276012
H  -0.743954 1.667175 -2.025291
H  0.808368 1.763181 -1.151812
H  -0.756161 3.682034 -0.564829
H  -0.371604 2.706476 0.867504
H  -2.210304 0.888275 1.689635
H  -3.687329 0.732715 0.699338
H  -2.83209 3.120532 0.832645
H  -2.939911 2.503706 -0.842497
H  0.028839 -1.133441 1.186592
H  0.207841 0.59683 1.5611
H  -2.230662 -1.740331 1.071085
H  -1.738116 -2.079936 -0.614413
H  -4.110404 -1.323767 -1.378244
H  1.696153 -2.243465 -0.441078
H  2.367553 1.700666 1.245846
H  4.113376 -2.388304 -1.070334
H  4.787722 1.555896 0.625309
H  -5.776736 -2.465371 0.075425
H  -4.499296 -2.630035 1.428322
H  5.672807 -0.488425 -0.540814
