program: Gaussian 09
title: 000118328
version: EM64L-G09RevD.01
frameworkgroup: C1[X(C18H21NO8)]
method: RPBEPBE
basis: SDD
operation: Freq
keyword: #p
keyword: freq=noraman
keyword: PBEPBE/SDD
title: #p freq=noraman PBEPBE/SDD
converged: NO YES NO NO
title: Mulliken charges:
elementType: O O O O O O O O N C C C C C C C C C C C C C C C C C C H H H H H H H H H H H H H H H H H H H H H
charge: -0.259873 -0.271703 -0.451836 -0.495922 -0.436633 -0.277227 -0.249323 -0.197736 -0.402403 -0.072933 -0.183820 -0.159058 -0.015666 -0.175259 -0.373466 0.241592 0.379213 -0.455812 -0.433100 -0.778703 0.206584 0.234566 -0.358376 0.405856 -0.481866 -0.810021 0.127001 0.301899 0.295274 0.246518 0.248773 0.277218 0.238822 0.181384 0.340415 0.360286 0.367238 0.364905 0.311691 0.258611 0.252531 0.256441 0.217033 0.248408 0.254562 0.242251 0.240952 0.240713
chargesum: 0.00000
title: Mulliken charges with hydrogens summed into heavy atoms:
elementType: O O O O O O O O N C C C C C C C C C C C C C C C C C C
charge: -0.259873 -0.271703 -0.091550 -0.128684 -0.071728 -0.277227 -0.249323 -0.197736 -0.061988 0.228966 0.111454 0.087460 0.233106 0.101959 0.046739 0.241592 0.379213 -0.144121 -0.174489 -0.052697 0.206584 0.234566 -0.109968 0.405856 -0.227305 -0.086106 0.127001
polarizability: 3.27348658e+02 -2.57061181e+01 2.58362997e+02 5.49640775e+00 9.67899796e+00 1.43576860e+02
1716.lowfreq: -13.3151 -4.6760 0.0002 0.0005 0.0006 4.1260 16.8509 23.9466 27.3832
frequency: 16.6611 23.3766 27.3460 34.7207 47.6035 68.2193 80.3732 89.6072 95.8854 104.6418 110.7369 154.4008 161.2377 167.5171 177.7926 182.1342 205.2376 214.0237 222.8352 234.0915 257.5183 278.1415 299.8778 310.9407 322.8109 324.6088 336.4859 362.4324 377.8596 413.0188 418.7093 447.1350 450.0511 460.3608 474.4947 487.5098 515.0541 535.4348 544.1586 548.7151 569.5333 575.3356 597.8685 621.5103 622.9715 639.2427 656.9754 669.0760 671.8812 717.9507 742.7744 751.5756 771.7247 791.0204 820.4213 821.5635 848.7204 866.1636 875.2828 917.1472 949.6226 951.1967 955.5753 960.0479 968.7916 977.9464 993.4430 995.4045 997.9214 1025.7883 1041.8246 1044.5252 1045.8411 1056.8140 1066.2333 1091.8454 1115.2752 1120.0606 1133.3182 1137.9211 1156.4262 1165.9184 1182.0139 1228.3961 1230.7001 1250.9399 1252.7832 1270.5742 1271.0471 1281.9638 1282.8204 1302.6375 1317.1922 1326.9362 1339.6777 1351.0164 1356.8357 1375.3665 1382.1588 1388.5305 1389.5907 1398.2055 1400.6275 1403.4642 1428.9713 1449.2451 1466.0629 1467.3050 1470.8914 1481.7078 1484.9142 1499.8139 1556.9080 1609.9676 1611.1161 1618.8758 1690.8000 2949.3238 2982.2533 2989.9619 2997.7679 3000.1319 3001.8220 3014.6763 3034.4205 3058.9475 3085.2009 3095.8370 3104.2430 3104.3143 3152.7181 3172.2463 3179.0341 3193.6428 3448.9676 3535.9426 3543.0080 3567.3484
redmass: 5.8176 6.2266 6.0525 6.2596 4.7266 1.5206 2.1151 4.1239 7.2317 4.4313 6.1467 5.3517 5.3666 1.6845 5.3704 4.6127 1.7249 4.7526 4.5214 4.3507 6.5108 4.4900 4.4457 3.9035 6.2875 1.6642 2.6235 3.1809 4.4963 4.8216 5.6962 3.6859 3.0651 1.4038 5.2413 3.4292 5.8080 1.8533 4.0341 2.8863 1.5231 2.2029 2.6139 5.0748 4.5937 4.3631 5.3734 3.8253 7.0118 5.6782 3.4991 5.3081 6.7698 6.9551 1.7136 2.0881 3.1880 1.8280 1.3867 2.5100 3.7898 3.4090 1.3376 4.1899 4.7980 5.3654 4.3427 1.7310 1.9166 3.3383 1.6772 3.1877 1.5914 4.4965 1.7367 2.5913 2.6855 2.3067 2.0223 1.9037 1.2009 1.8315 1.5314 2.3880 1.3252 1.8234 1.6281 1.2546 1.3713 1.2717 1.4826 1.3193 1.3883 1.3191 1.5339 1.3972 1.3189 1.6776 2.2470 1.2353 3.9072 1.5733 1.4479 1.2224 5.3802 1.0536 1.1268 1.0460 1.1056 1.0945 1.9386 3.4749 7.2420 7.2366 6.2799 7.1176 10.4497 1.0702 1.0382 1.0826 1.0360 1.0848 1.0855 1.0865 1.0851 1.0969 1.0944 1.0984 1.0985 1.1002 1.0883 1.0920 1.0965 1.0925 1.0660 1.0653 1.0781 1.0664
irintensity: 2.5429 0.5863 6.3072 4.1761 5.3293 5.2306 3.1399 0.5905 0.4514 9.1613 0.3026 6.8245 6.3473 0.1112 12.3509 0.8703 1.7623 1.0285 3.1400 6.9639 2.1693 7.6748 8.2278 1.6303 2.4261 10.8942 5.9157 12.4261 4.2419 0.0356 0.2950 29.4644 12.4011 124.9337 30.6132 67.8934 2.1957 29.5851 1.2395 54.1558 129.9188 79.7751 19.3107 20.1542 6.8316 7.1298 16.5578 5.3075 2.8280 1.0122 1.9433 11.0762 27.8440 38.0164 42.7523 5.0236 38.7450 65.7864 42.9380 36.4571 24.4567 72.4190 0.3685 49.5533 258.4324 5.4004 128.3762 23.3010 39.5814 118.9606 18.0418 47.6797 4.6750 112.2381 55.3812 22.3269 66.7805 9.8914 21.6556 72.2472 1.8595 70.0144 42.7927 79.9977 21.2904 123.1036 24.6250 14.2844 58.2872 16.8505 40.5957 10.5719 8.8727 57.1285 58.1324 32.9622 46.9056 60.6279 80.1900 63.0968 6.6615 5.5809 84.8759 44.8294 22.6071 26.1775 91.2638 17.1466 9.7444 4.3468 305.7234 9.1742 18.7327 124.6144 166.7276 349.4047 498.7196 49.5560 12.2950 12.5802 8.1990 14.1821 9.2848 49.0708 11.1969 12.4443 25.3319 10.5679 29.0970 9.3475 5.9363 1.7803 4.3977 0.9105 66.0120 19.4473 44.6426 13.6262
temp: 298.150 k
press: 1.00000 atm
elementType: 8 8 8 8 8 8 8 8 7 6 6 6 6 6 6 6 6 6 6 6 6 6 6 6 6 6 6 1 1 1 1 1 1 1 1 1 1 1 1 1 1 1 1 1 1 1 1 1
symmnumber: 1
zpe: 975651.0 jmol-1
zpe.correction: 0.371606 hartree
zpe.thermalcorrener: 0.397939 hartree
zpe.thermalcorrenthalpy: 0.398884 hartree
zpe.thermalcorrgfe: 0.313283 hartree
zpe.sumelectzpe: -1353.031101 hartree
zpe.sumelectthermal: -1353.004767 hartree
zpe.sumelectthermalent: -1353.003823 hartree
zpe.sumelectthermalfe: -1353.089424 hartree
dipole: 2.0781 -6.4291 -2.3206
dipole: 7.1440
quadrupole: -140.8024 -177.8605 -161.4693
quadrupole: 40.7741 -8.3458 13.3128
quadrupole: 19.2416 -17.8164 -1.4253 40.7741 -8.3458 13.3128
hfenergy: -1353.4027068 hartree
pointgroup: C01 [X(C18H21N1O8)]
dipole: -1.0363452 2.3644099 -1.1115113 debye
polarizability: 329.5679227|-22.5761079|252.1150197|-12.1677057|-20.1546721|147.605573 unknown
InChI: InChI=1S/C18H21NO8/c1-8-5-14(22)26-12-6-10(3-4-11(8)12)25-18-15(19-9(2)21)17(24)16(23)13(7-20)27-18/h3-6,13,15-20,23-24H,7H2,1-2H3
charge 0 multiplicity 1
48 atoms
O  -1.393633 -0.974849 -0.719327
O  -0.571465 1.168858 -0.220944
O  -3.035111 -1.04416 2.372529
O  -4.259859 -2.941491 0.62859
O  -2.428573 -4.560264 -0.775275
O  -5.137104 2.112326 0.577729
O  3.577765 -1.36901 -0.070464
O  5.517947 -2.617327 0.014897
N  -3.306464 1.250776 -0.556819
C  -2.746513 0.597347 0.635692
C  -3.617458 -0.599224 1.101283
C  -3.571821 -1.746621 0.070698
C  -2.118336 -2.175576 -0.22792
C  -1.335162 0.07231 0.322486
C  -2.018664 -3.261954 -1.310938
C  -4.44971 2.029656 -0.488199
C  0.829913 1.04456 -0.318929
C  1.528293 -0.164873 -0.145896
C  1.513464 2.254845 -0.614001
C  -4.824843 2.770702 -1.766863
C  2.934344 -0.144039 -0.254284
C  3.661428 1.049658 -0.545792
C  2.908653 2.247032 -0.726043
C  5.11571 0.974177 -0.647501
C  5.740797 -0.24512 -0.460664
C  5.920942 2.21745 -0.954407
C  5.033305 -1.484745 -0.164223
H  -2.705974 1.316014 1.475253
H  -4.655466 -0.24195 1.249145
H  -4.058369 -1.424399 -0.871616
H  -1.644033 -2.548388 0.703917
H  -0.865846 -0.339253 1.23875
H  -0.968477 -3.373965 -1.625444
H  -2.625498 -2.973168 -2.19688
H  -2.725899 1.25854 -1.398279
H  -3.454447 -1.913611 2.604616
H  -5.24107 -2.812799 0.585566
H  -3.271548 -4.41524 -0.262281
H  1.023064 -1.116874 0.025896
H  0.931988 3.172218 -0.737726
H  -5.87353 2.544734 -2.023846
H  -4.762816 3.857562 -1.582252
H  -4.180713 2.520119 -2.62718
H  3.431048 3.182313 -0.94911
H  6.828025 -0.339723 -0.528952
H  6.99854 1.992285 -0.99488
H  5.761844 2.996262 -0.184987
H  5.625134 2.654283 -1.926724
