program: Gaussian 09
title: 000118054
version: EM64L-G09RevD.01
frameworkgroup: C1[X(C14H20N2O)]
method: RPBEPBE
basis: SDD
operation: Freq
keyword: #p
keyword: freq=noraman
keyword: PBEPBE/SDD
title: #p freq=noraman PBEPBE/SDD
converged: YES YES NO NO
title: Mulliken charges:
elementType: O N N C C C C C C C C C C C C C C H H H H H H H H H H H H H H H H H H H H
charge: -0.320674 -0.382463 -0.086281 -0.229117 0.162038 -0.408618 -0.365879 -0.487090 0.379187 -0.259951 -0.358721 -0.392174 -0.420546 -0.227066 -0.221182 -0.678855 -0.246806 0.232786 0.205093 0.218919 0.218130 0.216652 0.227608 0.208156 0.325830 0.196767 0.209929 0.206921 0.215870 0.270894 0.276459 0.222885 0.221346 0.212923 0.224486 0.208330 0.224216
chargesum: 0.00000
title: Mulliken charges with hydrogens summed into heavy atoms:
elementType: O N N C C C C C C C C C C C C C C
charge: -0.320674 -0.056633 -0.086281 0.003668 0.162038 0.015393 0.068902 -0.051326 0.379187 0.146745 0.064069 -0.121280 -0.144087 -0.004181 0.000165 -0.033116 -0.022590
polarizability: 1.90129116e+02 -3.71837195e+00 1.57220017e+02 1.48726352e+00 -2.04514323e+01 1.40727240e+02
1716.lowfreq: -6.9557 -4.2104 -0.0008 -0.0004 0.0003 4.9690 20.1779 33.4244 45.5965
frequency: 20.0244 33.1750 45.5574 50.4525 68.2289 74.9120 138.0301 150.6427 173.3372 196.8783 219.8911 226.8057 258.6100 270.0490 312.0834 332.5232 403.9947 440.6767 451.7061 491.3767 506.2521 512.5466 546.7340 614.8942 618.9475 665.2327 700.2891 718.4026 755.7886 765.6148 815.0363 844.1501 860.3990 864.2982 872.4302 880.4766 885.3728 908.7424 937.5246 944.1814 972.5073 988.3232 990.1422 998.2577 1016.7015 1028.5437 1046.9825 1070.8554 1080.7203 1105.8791 1113.7258 1136.6408 1160.4164 1169.8835 1178.9061 1184.1892 1189.9782 1199.0980 1234.6247 1246.4397 1266.7493 1272.1560 1278.7341 1300.6959 1307.6534 1314.3309 1324.4400 1332.6751 1349.6608 1364.6350 1384.0612 1392.0129 1435.0526 1455.1131 1459.6366 1463.8728 1471.8409 1475.3849 1478.9415 1480.3690 1487.6116 1501.3702 1592.1122 1612.0052 1626.3808 2953.3477 2960.1414 2962.8746 2976.2353 2994.1614 2996.7417 2999.9024 3031.1063 3036.3689 3036.8957 3056.6504 3065.4673 3077.8342 3081.0264 3118.8654 3127.9352 3140.6437 3156.3068 3174.5622 3540.6305
redmass: 3.5589 3.8087 3.2655 3.9168 2.4613 2.1062 3.5297 3.4921 3.5331 3.4522 1.3190 2.3267 3.1085 3.6334 2.0798 5.3108 2.8943 4.0909 3.7356 4.3958 5.3161 2.3227 1.2666 5.8226 5.1564 4.6375 3.3798 1.5637 1.0973 2.0045 4.1097 2.6032 2.2166 1.2464 1.7722 1.6257 1.5694 2.5177 1.7960 2.4960 2.6613 2.1288 2.3710 1.3086 5.7548 2.2092 3.1020 2.2379 1.5982 2.1407 2.1727 3.6061 1.7099 1.0675 1.3563 1.1647 1.2987 1.8072 1.8053 1.2795 1.2707 1.3587 1.2702 1.3037 1.2636 1.2261 1.2662 1.3974 1.4101 1.3467 7.8054 1.2064 2.2124 1.1377 1.1265 1.0804 1.3240 1.0580 1.0423 2.2249 1.0810 1.4054 6.3617 6.0066 6.5990 1.0667 1.0638 1.0675 1.0362 1.0629 1.0620 1.0807 1.0954 1.0975 1.0935 1.1013 1.1044 1.1029 1.0991 1.0846 1.0887 1.0943 1.0989 1.0955 1.0774
irintensity: 0.9152 0.0119 3.4826 0.2296 0.2648 0.2622 0.2368 3.1497 1.9901 6.2071 1.5874 6.3711 0.7998 7.7116 14.1597 8.9954 0.0260 5.2733 3.6653 4.5347 7.6922 15.5753 93.3600 0.3932 0.6037 8.5831 0.3423 112.3221 7.9642 13.6084 1.6906 1.2041 2.4024 0.3471 3.0309 2.3380 3.7410 21.5984 7.2177 8.7437 3.1122 0.3404 0.6547 0.9473 168.9105 8.4314 27.2404 5.2541 7.7555 1.1680 0.0755 22.8641 10.3025 0.2909 12.6715 6.2496 6.0573 2.0184 3.3883 7.7192 3.2631 3.6022 7.4706 1.5046 3.2247 30.0631 6.1530 19.0638 30.2541 8.2994 0.3360 15.4642 12.3413 32.8239 6.3931 0.9433 38.1249 2.8715 12.4351 23.5411 16.4912 59.2592 1.7000 28.3635 119.6661 54.4400 36.7631 68.7590 44.0102 21.6884 23.2455 15.9612 42.1525 3.7118 64.6929 4.7502 54.0527 88.5923 42.9452 0.0732 9.3282 22.2533 36.4990 9.3435 35.6114
temp: 298.150 k
press: 1.00000 atm
elementType: 8 7 7 6 6 6 6 6 6 6 6 6 6 6 6 6 6 1 1 1 1 1 1 1 1 1 1 1 1 1 1 1 1 1 1 1 1
symmnumber: 1
zpe: 829037.7 jmol-1
zpe.correction: 0.315764 hartree
zpe.thermalcorrener: 0.332684 hartree
zpe.thermalcorrenthalpy: 0.333629 hartree
zpe.thermalcorrgfe: 0.268896 hartree
zpe.sumelectzpe: -728.904768 hartree
zpe.sumelectthermal: -728.887847 hartree
zpe.sumelectthermalent: -728.886903 hartree
zpe.sumelectthermalfe: -728.951635 hartree
dipole: -2.0544 0.8408 2.0919
dipole: 3.0502
quadrupole: -94.7004 -94.3486 -102.2646
quadrupole: 0.7653 -2.6358 1.5232
quadrupole: 2.4041 2.7559 -5.1601 0.7653 -2.6358 1.5232
hfenergy: -729.2205314 hartree
pointgroup: C01 [X(C14H20N2O1)]
dipole: 0.5429508 -0.5440571 0.9215623 debye
polarizability: 186.986808|-11.7704949|148.7453592|9.8172312|19.648394|152.3442055 unknown
InChI: InChI=1S/C14H20N2O/c1-2-11-17-13(12-7-4-3-5-8-12)14-15-9-6-10-16-14/h3-5,7-8,13,15H,2,6,9-11H2,1H3
charge 0 multiplicity 1
37 atoms
O  0.518726 1.101941 1.061181
N  0.638042 -1.649168 0.889779
N  1.333549 -1.405324 -1.415354
C  0.295566 0.499881 -0.263893
C  0.8169 -0.947727 -0.293598
C  2.137951 -3.374347 -0.012042
C  1.007824 -3.068263 1.000232
C  1.751609 -2.836858 -1.414198
C  -1.204183 0.563224 -0.571947
C  1.932054 1.4469 1.324783
C  2.358714 2.770591 0.665169
C  -1.67948 0.026245 -1.795598
C  -2.118369 1.158559 0.329123
C  -3.054366 0.083292 -2.110877
C  -3.495858 1.211606 0.011387
C  3.819801 3.129674 1.016708
C  -3.969075 0.675774 -1.207691
H  0.856336 1.044818 -1.048479
H  2.327763 -4.462698 -0.04795
H  3.068113 -2.878236 0.323992
H  0.130848 -3.716473 0.791904
H  1.340256 -3.28349 2.032679
H  2.604914 -2.93821 -2.1094
H  0.927281 -3.449091 -1.837239
H  0.271829 -1.127713 1.688442
H  2.593211 0.61552 0.99953
H  1.994326 1.531602 2.424921
H  2.249901 2.696214 -0.433912
H  1.674585 3.57172 1.002722
H  -0.965991 -0.440777 -2.484675
H  -1.740178 1.58054 1.264054
H  -3.412082 -0.332229 -3.060046
H  -4.197502 1.67494 0.714904
H  4.521381 2.352063 0.660286
H  4.113982 4.086572 0.550212
H  3.955694 3.232269 2.110055
H  -5.036372 0.720262 -1.453362
