program: Gaussian 09
title: 000117926
version: EM64L-G09RevD.01
frameworkgroup: C1[X(C4H4O2S)]
method: RPBEPBE
basis: SDD
operation: Freq
keyword: #pfreq=noraman
keyword: PBEPBE/SDD
title: #p freq=noraman PBEPBE/SDD
converged: NO NO NO NO
title: Mulliken charges:
elementType: S O O C C C C H H H H
charge: 0.864740 -0.529051 -0.529049 -0.364380 -0.364380 -0.099327 -0.099326 0.292286 0.292286 0.268100 0.268101
chargesum: 0.00000
title: Mulliken charges with hydrogens summed into heavy atoms:
elementType: S O O C C C C
charge: 0.864740 -0.529051 -0.529049 -0.072094 -0.072094 0.168774 0.168774
polarizability: 8.82414076e+01 -4.23632353e-08 6.31462266e+01 -2.20106979e-04 -8.09331946e-04 5.08822168e+01
1716.lowfreq: -19.5354 -15.7748 -9.6253 0.0024 0.0026 0.0036 142.8538 143.8755 262.9794
frequency: 142.8495 143.8746 262.9784 287.0789 384.6715 463.9944 484.4173 493.7433 620.9738 687.5323 694.2891 803.0631 809.8605 899.1352 928.3346 938.8646 945.6897 1039.1205 1061.7413 1217.2674 1275.6058 1531.5560 1608.3479 3160.0220 3171.1402 3244.3861 3248.6216
redmass: 4.4000 6.5157 6.9823 11.0393 3.3858 10.7633 2.7749 10.7860 5.5961 1.3022 1.2619 14.0210 4.0964 1.3132 12.1059 1.4609 2.0885 1.1760 1.1188 1.2725 1.6138 8.3082 5.5186 1.0905 1.0940 1.1035 1.1067
irintensity: 0.0000 0.4779 17.4050 13.2875 0.1083 11.4598 0.0000 18.7742 0.0043 0.0000 158.1929 56.9435 7.8136 1.8676 123.4139 0.0000 5.8345 0.5075 4.7477 34.6099 4.4875 5.4176 0.2465 6.1411 0.1717 12.4260 3.2881
temp: 298.150 k
press: 1.00000 atm
elementType: 16 8 8 6 6 6 6 1 1 1 1
symmnumber: 1
zpe: 182724.6 jmol-1
zpe.correction: 0.069596 hartree
zpe.thermalcorrener: 0.076510 hartree
zpe.thermalcorrenthalpy: 0.077455 hartree
zpe.thermalcorrgfe: 0.038617 hartree
zpe.sumelectzpe: -702.581408 hartree
zpe.sumelectthermal: -702.574494 hartree
zpe.sumelectthermalent: -702.573550 hartree
zpe.sumelectthermalfe: -702.612388 hartree
dipole: -6.2073 0.0000 0.0000
dipole: 6.2073
quadrupole: -48.3157 -38.9274 -58.5342
quadrupole: 0.0000 -0.0001 -0.0014
quadrupole: 0.2767 9.6650 -9.9418 0.0000 -0.0001 -0.0014
hfenergy: -702.6510046 hartree
pointgroup: C01 [X(C4H4O2S1)]
dipole: -2.4421326 -0.0000779 -0.0001542 debye
dipolederiv: 1.2421015 0.0000137 -0.0000041 0.000014 0.8302815 0.0001595 -0.0000111 0.000128 1.2991627 -0.562828 -0.000014 -0.0276432 -0.0000475 -0.4527247 -0.0000478 -0.1533197 -0.000049 -0.6066198 -0.5628421 0.0000065 0.0276478 0.0000402 -0.452724 -0.0000461 0.1533272 -0.0000384 -0.6066041 0.0218072 0.1482556 -0.0000201 0.0201884 -0.1373892 -0.0000738 0.0000303 -0.0000459 -0.3650029 0.0218172 -0.1482453 0.0000617 -0.0201787 -0.1374001 -0.0000667 0.0000203 -0.0000768 -0.3650031 -0.1340833 0.0563903 -0.0000175 0.1383814 0.0188112 -0.0000153 -0.0000644 -0.0000051 -0.0975779 -0.1340707 -0.0563997 0.0000224 -0.1383911 0.0187995 -0.0000387 0.0000706 -0.0000155 -0.0975776 0.0658198 -0.052139 -0.0000001 -0.0232005 0.0617521 0.0000406 -0.0000038 0.0000308 0.2185199 0.0658151 0.052139 -0.0000168 0.0232006 0.0617566 0.0000418 -0.0000122 0.0000429 0.2185198 -0.0117645 -0.1036869 0.000014 -0.0254449 0.0944144 0.0000218 0.0000045 0.0000047 0.2010915 -0.0117723 0.1036798 -0.0000441 0.0254382 0.0944227 0.0000248 -0.0000417 0.0000243 0.2010914 unknown
polarizability: 88.2414074|0.0008073|63.1462257|0.0024833|-0.0034175|50.8822178 unknown
InChI: InChI=1S/C4H4O2S/c5-7(6)3-1-2-4-7/h1-4H
charge 0 multiplicity 1
11 atoms
S  0.917409 0.000045 0.000072
O  1.738224 0.000475 1.411011
O  1.738373 -0.000333 -1.410781
C  -0.445192 -1.351576 0.000395
C  -0.445279 1.351577 -0.000378
C  -1.655414 -0.745918 0.000055
C  -1.655462 0.745842 -0.000222
H  -0.126214 -2.39243 0.000726
H  -0.126368 2.392452 -0.000666
H  -2.599997 -1.298464 0.000129
H  -2.60008 1.298328 -0.000442
